Peptide,PTM,ModifiedAA,ModifiedPosition,PeptideUniqueToGene,ExperimentDesc,ExpID,PubmedID,ScoreType,IdentScore,LocProb,Log2FChange,PQ-val,QuantSig,PEP,MassErrorPPM
GEGGAAADHHSEASSPSSLSAGAGNGAK,ph,S,72,true,"LAXIC - mannitol vs control",84b,23660473,XCorr,6.0900000,0.9880000,-1.2782581,,NO,1.2100000276405E-5,
GEGGAAADHHSEASSPSSLSAGAGNGAK,ph,S,72,true,"Tissue atlas Arabidopsis - ProteomicsDB",114,32188942,"MaxQuant score",253.6100000,0.9999840,,,,0,
GEGGAAADHHSEASSPSSLSAGAGNGAK,ph,S,75,true,"LAXIC - mannitol vs control",84b,23660473,XCorr,6.0900000,0.9360000,,,,1.2100000276405E-5,
GEGGAAADHHSEASSPSSLSAGAGNGAK,ph,S,75,true,"Tissue atlas Arabidopsis - ProteomicsDB",114,32188942,"MaxQuant score",152.1600000,0.9280460,,,,0,
GEGGAAADHHSEASSPSSLSAGAGNGAK,ph,S,76,true,"Chloroplast kinase substrates",60,19376835,"MASCOT Score",37.9500000,,,,,,0.5136780
GEGGAAADHHSEASSPSSLSAGAGNGAK,ph,S,76,true,"LAXIC - mannitol vs control",84b,23660473,XCorr,6.0900000,0.8540000,-1.2782581,,NO,1.2100000276405E-5,
GEGGAAADHHSEASSPSSLSAGAGNGAK,ph,S,76,true,"SnRK2 protein kinase substrates",85,23776212,XCorr,5.1569557,0.8240000,,,,0.0010816700523719,
GEGGAAADHHSEASSPSSLSAGAGNGAK,ph,S,76,true,"TOR Kinase and ABA Receptor",100,29290610,XCorr,3.5617642,0.7848000,,,,1.3879999869459E-6,
GEGGAAADHHSEASSPSSLSAGAGNGAK,ph,S,76,true,"Col-0 callus - FC Col-0 vs. Col-0 Xray",111a,31410901,,45.1800000,,0.1432510,0.0000000,NO,,0.7687358
GEGGAAADHHSEASSPSSLSAGAGNGAK,ph,S,76,true,"Col-0 X-ray callus - FC Col-0 vs. Col-0 Xray",111b,31410901,,45.1800000,,0.1432510,0.0000000,NO,,0.7687358
GEGGAAADHHSEASSPSSLSAGAGNGAK,ph,S,76,true,"atm callus - FC atm vs. atm Xray",111c,31410901,,45.1800000,,0.8674822,0.0000000,NO,,0.7687358
GEGGAAADHHSEASSPSSLSAGAGNGAK,ph,S,76,true,"atm-3 X-ray callus - FC atm vs. atm Xray",111d,31410901,,45.1800000,,0.8674822,0.0000000,NO,,0.7687358
GEGGAAADHHSEASSPSSLSAGAGNGAK,ph,S,76,true,"Tissue atlas Arabidopsis - ProteomicsDB",114,32188942,"MaxQuant score",314.8400000,0.9852300,,,,0,
GEGGAAADHHSEASSPSSLSAGAGNGAK,ph,S,78,true,"Tissue atlas Arabidopsis - ProteomicsDB",114,32188942,"MaxQuant score",54.5300000,0.7815910,,,,9.4909897597972E-5,
GNTSGSHIVNHLVR,ph,S,171,true,"Tissue atlas Arabidopsis - ProteomicsDB",114,32188942,"MaxQuant score",58.4610000,0.7824900,,,,0.001251730020158,
EVCLHR,sno,C,188,true,"hot5-4 / wildtype, FAT-switch S-nitrosoproteome",169,37277371,,,,0.0813817,0.9817283,NO,,
QGQGQVLVCAPSNVAVDQLAEK,so,C,538,true,"S-sulfenylation site detection using YAP1C",110,32714340,,,,,,,,
LQQLKDEQGELSSSDEKK,ph,S,608,true,"Tissue atlas Arabidopsis - ProteomicsDB",114,32188942,"MaxQuant score",114.7000000,0.7910340,,,,4.8188601795118E-5,
DEQGELSSSDEKK,ph,S,609,true,"atm and atr DNA damage response",88,25561503,"MASCOT Score",32.0000000,0.9040000,,,,,-2.2400000
SNEHQGIGFLNDPRR,nt,S,864,true,"Arabidopsis translation initiation landscape - NT",167b,35069635,,,,,,,,
PGLHPAGYPIPR,nt,P,990,true,"Arabidopsis translation initiation landscape - NT",167b,35069635,,,,,,,,
VPLSPFPGGPPSQPYAIPTR,ph,S,1005,true,"Tissue atlas Arabidopsis - ProteomicsDB",114,32188942,"MaxQuant score",159.1400000,1.0000000,,,,8.0815402880953E-29,
DGFSMGGISQDFLADDIK,fuc,S,1099,true,"SPINDLY O-fucosylation",162,36739885,,,,,,,-0.62999999523163,
