Peptide,PTM,ModifiedAA,ModifiedPosition,PeptideUniqueToGene,ExperimentDesc,ExpID,PubmedID,ScoreType,IdentScore,LocProb,Log2FChange,PQ-val,QuantSig,PEP,MassErrorPPM
SFQDLESGRG,nt,S,2,true,"N-term acetylation drought responses",5,26184543,,,,,,,,
SFQDLESGR,nt,S,2,true,"Arg/N-end rule seed, prt6 vs. Wt",99,29168982,"MASCOT Score",51.7900000,,,,,0.20999999344349,0.9952832
SFQDLESGRG,nta,S,2,true,"N-term acetylation drought responses",5,26184543,,,,,,,,
SFQDLESGR,nta,S,2,true,"Characterization plant N-terminal acetylation",6,22223895,"MASCOT Score",55.5200000,,,,,,
SFQDLESGR,nta,S,2,true,"Arg/N-end rule seed, prt6 vs. Wt",99,29168982,"MASCOT Score",51.7900000,,,,,0.20999999344349,0.9952832
SFQDLESGR,nta,S,2,true,"HUNTER N-terminome: legumain, GluC and trypsin",119,31951383,"MaxQuant score",82.7490000,,,,,,
SFQDLESGR,nta,S,2,true,"Arabidopsis translation initiation landscape - NTA",167a,35069635,,,,,,,,
SFQDLESGRGR,ph,S,2,true,"Tissue atlas Arabidopsis - ProteomicsDB",114,32188942,"MaxQuant score",65.5000000,1.0000000,,,,0.0043153897859156,
SFQDLESGR,ph,S,2,true,"atm and atr DNA damage response",88,25561503,"MASCOT Score",28.0000000,1.0000000,,,,,0.4900000
SFQDLESGRGR,ph,S,8,true,"Tissue atlas Arabidopsis - ProteomicsDB",114,32188942,"MaxQuant score",119.2500000,1.0000000,,,,5.4475399338116E-6,
SFQDLESGRGR,me1,R,10,true,"Arabidopsis protein methylome",123,31809900,"MaxQuant Score",74.2370000,1.0000000,,,,0.00048740100464784,-0.0145190
QDSTQAVASGIFQINTGVSTFQR,nt,Q,22,true,"HUNTER N-terminome: legumain, GluC and trypsin",119,31951383,"MaxQuant score",71.6510000,,,,,,
LVNTLGTPKDTPELR,ub,K,53,false,"Arabidopsis ubiquitination COFRADIC",40,26744219,"MaxQuant Score",44.9250000,1.0000000,,,,0.00032439999631606,-0.2850000
TRLHIGQLVKDTSAK,ub,K,74,true,"Ubiquitination Membrane Proteins",120,33585938,,,,,,,,
LHIGQLVKDTSAK,ub,K,74,true,"Ubiquitination Membrane Proteins",120,33585938,,,,,,,,
LHIGQLVKDTSAK,ub,K,74,true,"upl3 mutant / wildtype",168,35926874,"MaxQuant score",118.2400000,1.0000000,-0.7490384,0.0431800,YES,4.1420898924116E-6,0.2513700
DTSAKLK,ac,K,79,false,"Quantitative Acetylproteomics",101,29440448,,,,,,,,
KIADAKLAR,ub,K,97,true,"Ubiquitination Membrane Proteins",120,33585938,,,,,,,,
IADAKLAR,ub,K,102,true,"Ubiquitination Membrane Proteins",120,33585938,,,,,,,,
DFQAVLKEFQK,ub,K,112,false,"Ubiquitination Membrane Proteins",120,33585938,,,,,,,,
DFQAVLKEFQK,ub,K,112,false,"upl3 mutant / wildtype",168,35926874,"MaxQuant score",80.6900000,1.0000000,-0.4560093,0.1186150,NO,0.0013478200417012,-0.4953700
ETTYTPFVPQSALPSSYTAGEVDKVPEQR,ph,T,129,true,"Tissue atlas Arabidopsis - ProteomicsDB",114,32188942,"MaxQuant score",93.2900000,0.8633800,,,,1.7789400516614E-16,
AQLQESKR,ac,K,160,true,"Quantitative Acetylproteomics",101,29440448,,,,,,,,
AATSQGKSQLVQAAK,ph,S,228,true,"Tissue atlas Arabidopsis - ProteomicsDB",114,32188942,"MaxQuant score",64.4070000,0.9847040,,,,0.00082486600149423,
AATSQGKSQLVQAAK,ac,K,231,true,"Quantitative Acetylproteomics",101,29440448,,,,,,,,
AATSQGKSQLVQAAK,ub,K,231,true,"Ubiquitination Membrane Proteins",120,33585938,,,,,,,,
AATSQGKSQLVQAAK,ub,K,231,true,"upl3 mutant / wildtype",168,35926874,"MaxQuant score",151.2200000,1.0000000,1.7437304,,,2.2720100269474E-15,-0.2256100
SQLVQAAK,ph,S,232,true,"Tissue atlas Arabidopsis - ProteomicsDB",114,32188942,"MaxQuant score",204.7800000,1.0000000,,,,8.4077907859489E-45,
