Peptide,PTM,ModifiedAA,ModifiedPosition,PeptideUniqueToGene,ExperimentDesc,ExpID,PubmedID,ScoreType,IdentScore,LocProb,Log2FChange,PQ-val,QuantSig,PEP,MassErrorPPM
KLTDSGDEKETISEAVEESGLVSK,ph,S,96,true,"Arabidopsis root NAA phosphoproteome",18a,27643528,"MaxQuant Score",137.2100000,0.9890000,,,,7.3140003036568E-26,-0.3180000
KLTDSGDEKETISEAVEESGLVSK,ph,S,96,true,"SnRK2 protein kinase substrates",85,23776212,XCorr,5.0965433,0.9270000,,,,7.4969700315352E-14,
LTDSGDEKETISEAVEESGLVSK,ph,S,96,true,"Tissue atlas Arabidopsis - ProteomicsDB",114,32188942,"MaxQuant score",393.0000000,0.9999970,,,,0,
KLTDSGDEK,ph,S,96,true,"atm and atr DNA damage response",88,25561503,"MASCOT Score",47.0000000,1.0000000,,,,,-2.5900000
KLTDSGDEKETISEAVEESGLVSK,ph,T,102,true,"LAXIC - mannitol vs control",84b,23660473,XCorr,5.1600000,0.9890000,-1.2370125,,NO,4.7999998073478E-12,
LTDSGDEKETISEAVEESGLVSK,ph,T,102,true,"LAXIC - mannitol vs control",84b,23660473,XCorr,4.1400000,0.9620000,,,,3.8300000596792E-5,
LTDSGDEKETISEAVEESGLVSK,ph,T,102,true,"SnRK2 protein kinase substrates",85,23776212,XCorr,4.7153921,0.9030000,,,,2.3759399780943E-8,
LTDSGDEKETISEAVEESGLVSK,ph,T,102,true,"Tissue atlas Arabidopsis - ProteomicsDB",114,32188942,"MaxQuant score",122.2200000,0.9693890,,,,5.1389600248106E-22,
KVGEKR,ac,K,142,false,"Lysine acetylation gel-based Arabidopsis",36,21311030,"MASCOT Score",27.0000000,,,,,,-0.0214000
KVGEKR,ac,K,146,false,"Lysine acetylation gel-based Arabidopsis",36,21311030,"MASCOT Score",27.0000000,,,,,,-0.0214000
KSNPSEAYSPAQK,ph,S,379,true,"Tissue atlas Arabidopsis - ProteomicsDB",114,32188942,"MaxQuant score",195.2800000,1.0000000,,,,1.363470003451E-30,
DKVVTPTPTGK,ph,T,392,true,"Tissue atlas Arabidopsis - ProteomicsDB",114,32188942,"MaxQuant score",107.6000000,0.9783410,,,,0.00018736999481916,
