Peptide,PTM,ModifiedAA,ModifiedPosition,PeptideUniqueToGene,ExperimentDesc,ExpID,PubmedID,ScoreType,IdentScore,LocProb,Log2FChange,PQ-val,QuantSig,PEP,MassErrorPPM
STATDEAVETSSN,nt,S,63,true,"Arg/N-end rule seed, prt6 vs. Wt",99,29168982,"MASCOT Score",50.6700000,,,,,0.015619999729097,1.0661124
LCEMEQKHVFDGLR,ac,K,305,true,"Histone deacetylases - apicidin vs control",98a,29061669,"MaxQuant Score",183.4000000,1.0000000,-0.1520000,0.4226686,NO,0,
LCEMEQKHVFDGLR,ac,K,305,true,"Histone deacetylases substrates - TSA vs control",98b,29061669,"MaxQuant Score",183.4000000,1.0000000,0.1460000,0.9977001,NO,0,
LCEMEQKHVFDGLR,ac,K,305,true,"Histone deacetylases- hda14 vs WT (low light)",98c,29061669,"MaxQuant Score",173.0300000,1.0000000,0.3410000,0.9885531,NO,3.7000000285836E-10,
LCEMEQKHVFDGLR,ac,K,305,true,"Histone deacetylases substrates - hda14 vs WT",98e,29061669,"MaxQuant Score",162.7000000,1.0000000,0.3060000,0.5000345,NO,0,
VSECNLSVSR,ox,C,364,true,"SPEAR - 50 mM H2O2 / mock",138b,34619326,,,,2.4298743,0.0060351,YES,,
ECLSFDASK,sno,C,372,true,"hot5-4 / wildtype, FAT-switch S-nitrosoproteome",169,37277371,,,,0.5584052,0.0178894,NO,,
VPLVIVSPE,nt,V,444,true,"Arg/N-end rule seed, prt6 vs. Wt",99,29168982,"MASCOT Score",36.6900000,,-0.4500934,0.2947813,NO,0.012719999998808,0.8934836
EETLPVVCSSPEEPK,ox,C,487,true,"SPEAR - 10 mM H2O2 / mock",138a,34619326,,,,0.2480188,0.0385903,YES,,
EETLPVVCSSPEEPK,sno,C,487,true,"Site-specific nitrosomeproteomic id - gsnor1-3",90b,25699590,XCorr,2.9082687,,,,,0.090570002794266,-6.9517509
