Peptide,PTM,ModifiedAA,ModifiedPosition,PeptideUniqueToGene,ExperimentDesc,ExpID,PubmedID,ScoreType,IdentScore,LocProb,Log2FChange,PQ-val,QuantSig,PEP,MassErrorPPM
MNLTFISIGR,ng,N,432,true,"Conserved N-glycosylation",74,22633491,"MaxQuant Score",96.0280000,1.0000000,,,,0.0010000000474975,1.1380000
EMSNLTLLQGLR,ng,N,525,true,"Conserved N-glycosylation",74,22633491,"MaxQuant Score",134.2500000,1.0000000,,,,5.1289999808066E-14,0.1610000
FNGSIPASLK,ng,N,588,true,"Conserved N-glycosylation",74,22633491,"MaxQuant Score",77.1380000,1.0000000,,,,0.0089999996125698,0.9810000
FNGSIPASLK,ng,N,588,true,"N-linked Glycan Micro-heterogeneity Arabidopsis",134,29237727,,,,,,,,
FNGSIPASLK,ng,N,588,true,"UDP-GlcNAc transporter glycopeptide analysis",135,30224661,,,,,,,5.0528869905975E-6,0.4000000
NINASDLMGNTDLCGSK,ng,N,772,true,"Conserved N-glycosylation",74,22633491,"MaxQuant Score",184.4100000,0.9100000,,,,0,0.8020000
TLSQLKHR,ub,K,924,true,"Ubiquitination Membrane Proteins",120,33585938,,,,,,,,
ILGFAWESGKTK,ub,K,940,true,"Ubiquitination Membrane Proteins",120,33585938,,,,,,,,
ANSFREDR,ph,S,1162,true,"atm and atr DNA damage response",88,25561503,"MASCOT Score",26.0000000,1.0000000,,,,,-0.1200000
