Peptide,PTM,ModifiedAA,ModifiedPosition,PeptideUniqueToGene,ExperimentDesc,ExpID,PubmedID,ScoreType,IdentScore,LocProb,Log2FChange,PQ-val,QuantSig,PEP,MassErrorPPM
ASASTVSAPKRET,nt,A,45,true,"Arabidopsis translation initiation landscape - NT",167b,35069635,,,,,,,,
SASTVSAPKRETDPKKRVVITGMGL,nt,S,46,true,"Arabidopsis translation initiation landscape - NT",167b,35069635,,,,,,,,
SASTVSAPKRETDPKKR,nt,S,46,true,"Arg/N-end rule pathway Roots",80,25728785,"MASCOT Score",29.6900000,,,,,0.0039630001410842,
SASTVSAPKRE,nt,S,46,true,"N-terminal ChaFRADIC",92,26010716,"MASCOT Score",25.3400000,,,,,1.496999993833E-5,
SASTVSAPKRE,nt,S,46,true,"Arg/N-end rule seed, prt6 vs. Wt",99,29168982,"MASCOT Score",33.0000000,,,,,0.0057169999927282,-0.4990106
SASTVSAPKR,nt,S,46,true,"Arg/N-end rule pathway Roots",80,25728785,"MASCOT Score",53.7400000,,,,,0.00019449999672361,
SASTVSAPKR,nt,S,46,true,"Arg/N-end rule seed, prt6 vs. Wt",99,29168982,"MASCOT Score",33.1700000,,,,,0.1330000013113,-1.5464722
SASTVSAPKRETDPKKRVVITGMGL,nta,S,46,true,"Arabidopsis translation initiation landscape - NTA",167a,35069635,,,,,,,,
SASTVSAPKRE,nta,S,46,true,"N-terminal ChaFRADIC",92,26010716,"MASCOT Score",23.2700000,,,,,0.017500000074506,
SASTVSAPKRE,nta,S,46,true,"Arg/N-end rule seed, prt6 vs. Wt",99,29168982,"MASCOT Score",33.0000000,,0.2204707,0.0324953,NO,0.0057169999927282,-0.4990106
SASTVSAPKR,nta,S,46,true,"Arg/N-end rule pathway Roots",80,25728785,"MASCOT Score",46.6400000,,,,,0.00086730002658442,
SASTVSAPKR,nta,S,46,true,"Arg/N-end rule seed, prt6 vs. Wt",99,29168982,"MASCOT Score",33.1700000,,0.1267554,0.5722599,NO,0.1330000013113,-1.5464722
ASTVSAPKRET,nt,A,47,true,"Arabidopsis translation initiation landscape - NT",167b,35069635,,,,,,,,
DVDAYYE,nt,D,77,true,"Arg/N-end rule seed, prt6 vs. Wt",99,29168982,"MASCOT Score",42.1800000,,-1.0416664,0.0461548,YES,0.036839999258518,-2.8818280
GESGISLIDR,nt,G,88,true,"Arg/N-end rule seed, prt6 vs. Wt",99,29168982,"MASCOT Score",40.4500000,,-0.1460030,0.6740577,NO,0.12770000100136,-0.3140393
FDASKFPTR,ph,S,101,true,"Tissue atlas Arabidopsis - ProteomicsDB",114,32188942,"MaxQuant score",86.7720000,0.9998900,,,,0.0053581697866321,
FDASKFPTR,ac,K,102,true,"Histone deacetylases - apicidin vs control",98a,29061669,"MaxQuant Score",101.4000000,1.0000000,-0.1480000,0.4497799,NO,0.0040000001899898,
GFSSEGYIDGKNER,nt,G,113,true,"Arabidopsis translation initiation landscape - NT",167b,35069635,,,,,,,,
GFSSEGYIDGK,ph,S,115,true,"Tissue atlas Arabidopsis - ProteomicsDB",114,32188942,"MaxQuant score",96.3340000,0.9934520,,,,0.00011055300274165,
GFSSEGYIDGKNER,ac,K,123,true,"Histone deacetylases - apicidin vs control",98a,29061669,"MaxQuant Score",45.6000000,1.0000000,0.1920000,0.5546257,NO,0.00060000002849847,
GFSSEGYIDGKNER,ac,K,123,true,"Histone deacetylases- hda14 vs WT (low light)",98c,29061669,"MaxQuant Score",200.6300000,1.0000000,3.1150000,0.1534617,NO,1.5999999719227E-13,
GFSSEGYIDGKNER,ac,K,123,true,"Histone deacetylases substrates - hda14 vs WT",98e,29061669,"MaxQuant Score",90.7000000,1.0000000,2.9070000,0.0112980,YES,1.2000000104706E-8,
GFSSEGYIDGKNER,ac,K,123,true,"Quantitative Acetylproteomics",101,29440448,,,,,,,,
GFSSEGYIDGKNER,ub,K,123,true,"Arabidopsis ubiquitination COFRADIC",40,26744219,"MaxQuant Score",54.0900000,1.0000000,,,,0.00050060002831742,-0.1280000
LDDCLK,sno,C,131,false,"hot5-4 / wildtype, FAT-switch S-nitrosoproteome",169,37277371,,,,1.0725756,0.0123850,YES,,
YCIVAGK,acy,C,135,true,"Arabidopsis S-acylation atlas - Meristem",163a,35681017,,,,,,,,
YCIVAGK,ox,C,135,true,"OxiTRAQ Arabidopsis - 5 mM H2O2 versus control",47,24376095,,,,0.1329231,0.3030880,NO,,
YCIVAGK,so,C,135,true,"S-sulfenylation site detection using YAP1C",110,32714340,,,,,,,,
ALESANLGGDKLNTIDKR,ph,T,155,true,"Tissue atlas Arabidopsis - ProteomicsDB",114,32188942,"MaxQuant score",49.6600000,0.9693570,,,,0.0018663100199774,
KALESANLGGDKLNTIDKR,ac,K,158,true,"Quantitative Acetylproteomics",101,29440448,,,,,,,,
ALESANLGGDKLNTIDKR,ac,K,158,true,"Quantitative Acetylproteomics",101,29440448,,,,,,,,
LNTIDKR,ac,K,158,true,"Quantitative Acetylproteomics",101,29440448,,,,,,,,
RGEADMMIAGGTEAAIIPIGLGGFVACR,so,C,266,true,"S-sulfenylation site detection using YAP1C",110,32714340,,,,,,,,
NDDPQTASRPWDKAR,ac,K,285,true,"Quantitative Acetylproteomics",101,29440448,,,,,,,,
GAPIVAEYLGGAVNCDAHHMTDPR,sno,C,325,true,"Site-specific nitrosomeproteomic id - gsnor1-3",90b,25699590,XCorr,2.3300000,,,,,0.12630000710487,-5.0700000
GAPIVAEYLGGAVNCDAHHMTDPR,sno,C,325,true,"hot5-4 / wildtype, FAT-switch S-nitrosoproteome",169,37277371,,,,0.0224641,0.8817454,NO,,
ADGLGVSSCIER,ox,C,343,true,"OxiTRAQ Arabidopsis - 5 mM H2O2 versus control",47,24376095,,,,0.3183273,0.0875071,NO,,
ADGLGVSSCIER,ox,C,343,true,"Redox kickstart of mitochondria",112,31871212,,,,-0.6854357,0.0173201,YES,,
ADGLGVSSCIER,sno,C,343,true,"Site-specific nitrosomeproteomic id - gsnor1-3",90a,25699590,XCorr,3.4471481,,,,,0.00076470000203699,-7.0770749
ADGLGVSSCIER,sno,C,343,true,"Site-specific nitrosomeproteomic id - gsnor1-3",90b,25699590,XCorr,3.0000000,,,,,0.0077599999494851,-7.1500000
ADGLGVSSCIER,sno,C,343,true,"hot5-4 / wildtype, FAT-switch S-nitrosoproteome",169,37277371,,,,0.2220821,0.1287358,NO,,
ADGLGVSSCIER,so,C,343,true,"S-sulfenylation site detection using YAP1C",110,32714340,,,,,,,,
KVFKSTSGIK,ac,K,384,true,"Quantitative Acetylproteomics",101,29440448,,,,,,,,
VFKSTSGIK,ac,K,384,true,"Quantitative Acetylproteomics",101,29440448,,,,,,,,
SMIGHCLGAAGGLEAIATVK,so,C,401,true,"S-sulfenylation site detection using YAP1C",110,32714340,,,,,,,,
LGAAGGLE,nt,L,402,true,"Arg/N-end rule seed, prt6 vs. Wt",99,29168982,"MASCOT Score",63.8800000,,-0.6028275,0.0043371,NO,0.0022789998911321,-0.9599927
QAVDFDTVPNEKKQHE,nt,Q,433,true,"HUNTER N-terminome: legumain, GluC and trypsin",119,31951383,"MaxQuant score",45.7230000,,,,,,
