Peptide,PTM,ModifiedAA,ModifiedPosition,PeptideUniqueToGene,ExperimentDesc,ExpID,PubmedID,ScoreType,IdentScore,LocProb,Log2FChange,PQ-val,QuantSig,PEP,MassErrorPPM
SSLPLRSGEKMESPSIS,nta,S,2,true,"Arabidopsis translation initiation landscape - NTA",167a,35069635,,,,,,,,
SSLPLRSGEK,ph,S,8,true,"Tissue atlas Arabidopsis - ProteomicsDB",114,32188942,"MaxQuant score",56.1740000,0.9999420,,,,0.0045878798700869,
NSGEDRDQDHGENPVETDGVVVPIDELNQK,ph,S,78,true,"Tissue atlas Arabidopsis - ProteomicsDB",114,32188942,"MaxQuant score",147.3700000,1.0000000,,,,0,
RLSPLPEIRDPK,ph,S,182,true,"Tissue atlas Arabidopsis - ProteomicsDB",114,32188942,"MaxQuant score",58.4610000,1.0000000,,,,0.005046010017395,
SVSICDPNAVEESEK,sno,C,225,true,"Site-specific nitrosomeproteomic id - gsnor1-3",90a,25699590,XCorr,3.6166751,,,,,6.0119998579466E-7,-6.8857088
SVSICDPNAVEESEK,sno,C,225,true,"Site-specific nitrosomeproteomic id - gsnor1-3",90b,25699590,XCorr,3.3400000,,,,,0.036520000547171,-4.1600000
SVSICDPNAVEESEKGGKK,ph,S,233,true,"Tissue atlas Arabidopsis - ProteomicsDB",114,32188942,"MaxQuant score",60.8000000,0.9999850,,,,0.00021613799617626,
LHHSDNPADDDGGNHQK,ph,S,331,true,"Tissue atlas Arabidopsis - ProteomicsDB",114,32188942,"MaxQuant score",54.8340000,1.0000000,,,,0.00097861501853913,
