Peptide,PTM,ModifiedAA,ModifiedPosition,PeptideUniqueToGene,ExperimentDesc,ExpID,PubmedID,ScoreType,IdentScore,LocProb,Log2FChange,PQ-val,QuantSig,PEP,MassErrorPPM
VMNVATEINSVEQAK,nta,V,56,true,"Characterization plant N-terminal acetylation",6,22223895,"MASCOT Score",54.8800000,,,,,,
VATEINSVEQAKKIDSKESAR,nt,V,59,true,"FtsH12 N-terminome: WT / FtsH12 knockdown miRNA",118,33216923,"MaxQuant score",57.3480000,,,,,0.016325000673532,
VATEINSVEQAKKIDSKESAR,nt,V,59,true,"HUNTER N-terminome: legumain, GluC and trypsin",119,31951383,"MaxQuant score",67.7600000,,,,,,
VATEINSVEQAKKIDSKESAR,nta,V,59,true,"FtsH12 N-terminome: WT / FtsH12 knockdown miRNA",118,33216923,"MaxQuant score",132.2300000,,,,,0,
VATEINSVEQAKKIDSKESAR,nta,V,59,true,"HUNTER N-terminome: legumain, GluC and trypsin",119,31951383,"MaxQuant score",100.6700000,,,,,,
VATEINSVEQAK,nta,V,59,true,"Characterization plant N-terminal acetylation",6,22223895,"MASCOT Score",97.8800000,,,,,,
LCLLLNVIDPK,so,C,96,false,"S-sulfenylation site detection using YAP1C",110,32714340,,,,,,,,
IGGVMIMGDRGTGK,mox,M,110,false,"cat2 Methionine oxidation - 1h stress",62a,25693801,"MASCOT Score",57.0000000,,0.0715589,,NO,,
IGGVMIMGDRGTGK,mox,M,110,false,"cat2 Methionine oxidation - 3h stress",62b,25693801,"MASCOT Score",55.0000000,,0.0059662,,NO,,
IGGVMIMGDRGTGK,mox,M,112,false,"cat2 Methionine oxidation - 1h stress",62a,25693801,"MASCOT Score",57.0000000,,0.0715589,,NO,,
IGGVMIMGDRGTGK,mox,M,112,false,"cat2 Methionine oxidation - 3h stress",62b,25693801,"MASCOT Score",55.0000000,,0.0059662,,NO,,
GTGKSTTVR,ac,K,119,false,"Quantitative Acetylproteomics",101,29440448,,,,,,,,
GTGKSTTVR,ub,K,119,false,"Arabidopsis ubiquitination COFRADIC",40,26744219,"MaxQuant Score",84.0540000,1.0000000,,,,0.0080000003799796,-0.2420000
DLPLGATEDR,nt,D,176,false,"Metacaspase9 substrates - in vitro rMC9",51c,23964026,"MASCOT Score",48.0000000,,2.1596301,,NO,,0.0000000
VCGTIDIEK,ox,C,187,false,"SPEAR - 50 mM H2O2 / mock",138b,34619326,,,,1.9109166,0.0195922,YES,,
VCGTIDIEK,sno,C,187,false,"hot5-4 / wildtype, FAT-switch S-nitrosoproteome",169,37277371,,,,,,,,
INMVDLPLGATEDRVCGTIDIEK,so,C,187,false,"Arabidopsis S-sulfenylation chemoproteomics",108,31578252,"pFind PSM Score",0.0129698,,1.2987000,,,,-1.1344393
VCGTIDIEK,so,C,187,false,"S-sulfenylation site detection using YAP1C",110,32714340,,,,,,,,
FGMHAQVGTVR,ph,T,285,false,"Tissue atlas Arabidopsis - ProteomicsDB",114,32188942,"MaxQuant score",79.8040000,1.0000000,,,,0.00066355901071802,
VKIVEER,ub,K,294,false,"Arabidopsis ubiquitination COFRADIC",40,26744219,"MaxQuant Score",52.7160000,1.0000000,,,,0.01799999922514,0.1440000
QITTARSNLSAVQIDQD,nt,Q,323,true,"HUNTER N-terminome: legumain, GluC and trypsin",119,31951383,"MaxQuant score",155.0800000,,,,,,
VCAELDVDGLR,sno,C,348,true,"Site-specific nitrosomeproteomic id - gsnor1-3",90a,25699590,XCorr,3.1150737,,,,,2.4790000679786E-5,-5.4101280
VCAELDVDGLR,sno,C,348,true,"Site-specific nitrosomeproteomic id - gsnor1-3",90b,25699590,XCorr,3.5600000,,,,,0.024520000442863,-5.7100000
VCAELDVDGLR,sno,C,348,true,"hot5-4 / wildtype, FAT-switch S-nitrosoproteome",169,37277371,,,,0.5130682,0.0240219,NO,,
