Peptide,PTM,ModifiedAA,ModifiedPosition,PeptideUniqueToGene,ExperimentDesc,ExpID,PubmedID,ScoreType,IdentScore,LocProb,Log2FChange,PQ-val,QuantSig,PEP,MassErrorPPM
VVLIGDSGVGK,ph,S,22,false,"Tissue atlas Arabidopsis - ProteomicsDB",114,32188942,"MaxQuant score",77.6440000,1.0000000,,,,0.0015941200545058,
VVLIGDSGVGKSNLLSR,ac,K,26,false,"Quantitative Acetylproteomics",101,29440448,,,,,,,,
FTKNEFSLESK,ac,K,35,true,"Quantitative Acetylproteomics",101,29440448,,,,,,,,
STIGVEFATR,ph,S,44,false,"atm and atr DNA damage response",88,25561503,"MASCOT Score",29.0000000,0.9400000,,,,,-0.7200000
STIGVEFATR,ph,S,44,false,"Tissue atlas Arabidopsis - ProteomicsDB",114,32188942,"MaxQuant score",105.3600000,0.8887440,,,,0.00028267700690776,
STIGVEFATR,ph,T,45,false,"Pollen phosphoproteome Arabidopsis",43,22631563,"MASCOT Score",51.5800000,,,,,,-3.9184000
AITSAYYR,ph,S,80,false,"Tissue atlas Arabidopsis - ProteomicsDB",114,32188942,"MaxQuant score",99.8150000,0.9952010,,,,0.0051553300581872,
HSTFENVETWLKELR,ph,T,100,true,"Sucrose-induced phosphorylation",24,17586839,,,,,,,,
