Peptide,PTM,ModifiedAA,ModifiedPosition,PeptideUniqueToGene,ExperimentDesc,ExpID,PubmedID,ScoreType,IdentScore,LocProb,Log2FChange,PQ-val,QuantSig,PEP,MassErrorPPM
NHMHNNNKQSPVLTDR,ph,S,44,true,"Tissue atlas Arabidopsis - ProteomicsDB",114,32188942,"MaxQuant score",90.3160000,0.9999990,,,,3.8218400732148E-5,
QSPVLTDR,ph,S,44,false,"atm and atr DNA damage response",88,25561503,"MASCOT Score",29.0000000,1.0000000,,,,,0.2600000
QSPVLTDR,ph,S,44,false,"TOR Kinase and ABA Receptor",100,29290610,XCorr,2.5005238,1.0000000,,,,0.0011790000135079,
SLRDPSASPNLKEDHQDSR,ph,S,72,true,"Tissue atlas Arabidopsis - ProteomicsDB",114,32188942,"MaxQuant score",77.6930000,0.9679900,,,,4.9072899855673E-5,
LSGSSPIVSFGTSK,ph,S,97,true,"Tissue atlas Arabidopsis - ProteomicsDB",114,32188942,"MaxQuant score",229.3900000,0.9998080,,,,0,
LSGSSPIVSFGTSK,ph,T,104,true,"atm and atr DNA damage response",88,25561503,"MASCOT Score",36.0000000,0.9920000,,,,,-0.1600000
VTPSDEKFDR,ph,S,110,true,"Tissue atlas Arabidopsis - ProteomicsDB",114,32188942,"MaxQuant score",66.7080000,0.9998940,,,,0.0022231200709939,
SLSCGISDSK,ph,S,265,true,"Tissue atlas Arabidopsis - ProteomicsDB",114,32188942,"MaxQuant score",85.5220000,0.9997950,,,,0.0019258200190961,
SLSCGISDSK,ph,S,269,true,"Tissue atlas Arabidopsis - ProteomicsDB",114,32188942,"MaxQuant score",81.6760000,0.9599450,,,,0.0026183701120317,
FRESGRSEIVEVADSESPMTR,ph,S,839,true,"Tissue atlas Arabidopsis - ProteomicsDB",114,32188942,"MaxQuant score",68.5890000,0.9999990,,,,7.5604002631735E-5,
FRESGRSEIVEVADSESPMTR,ph,S,842,true,"Tissue atlas Arabidopsis - ProteomicsDB",114,32188942,"MaxQuant score",68.5890000,0.9999990,,,,7.5604002631735E-5,
SEIVEVADSESPMTR,ph,S,850,true,"Tissue atlas Arabidopsis - ProteomicsDB",114,32188942,"MaxQuant score",130.0600000,0.7637780,,,,6.6785997887564E-7,
SEIVEVADSESPMTR,ph,S,852,true,"Tissue atlas Arabidopsis - ProteomicsDB",114,32188942,"MaxQuant score",248.8100000,0.9782150,,,,0,
CLSTRSPPR,ph,S,963,true,"Tissue atlas Arabidopsis - ProteomicsDB",114,32188942,"MaxQuant score",71.8880000,0.9331750,,,,0.0019968498963863,
