Peptide,PTM,ModifiedAA,ModifiedPosition,PeptideUniqueToGene,ExperimentDesc,ExpID,PubmedID,ScoreType,IdentScore,LocProb,Log2FChange,PQ-val,QuantSig,PEP,MassErrorPPM
YGVSANSPQPQVVHNSSDAGR,ph,S,162,true,"Tissue atlas Arabidopsis - ProteomicsDB",114,32188942,"MaxQuant score",161.5000000,0.9994520,,,,1.9979300078101E-30,
YCVSANSPQPQVVHSSSDAGR,ph,S,183,true,"Tissue atlas Arabidopsis - ProteomicsDB",114,32188942,"MaxQuant score",169.3000000,0.9999450,,,,9.0747303822535E-39,
YGVSANSPQR,ph,S,204,true,"atm and atr DNA damage response",88,25561503,"MASCOT Score",30.0000000,1.0000000,,,,,-0.2100000
YGVSANSPQR,ph,S,204,true,"TOR Kinase and ABA Receptor",100,29290610,XCorr,3.3990097,0.9352000,,,,0.00077609997242689,
YGVSANSPQR,ph,S,204,true,"Lateral root-induction - NAA vs control",106,23328941,"MASCOT Score",42.0000000,,,,,,
YGVSANSPQR,ph,S,204,true,"Tissue atlas Arabidopsis - ProteomicsDB",114,32188942,"MaxQuant score",222.9100000,1.0000000,,,,1.5486399793923E-27,
QVVHNSPDAGR,ph,S,213,true,"atm and atr DNA damage response",88,25561503,"MASCOT Score",48.0000000,1.0000000,,,,,0.3600000
QVVHNSPDAGR,ph,S,213,true,"Tissue atlas Arabidopsis - ProteomicsDB",114,32188942,"MaxQuant score",157.2200000,1.0000000,,,,1.6462599339295E-10,
YGTGSGYPETSPSTRPYVSSNAGYGGSR,ph,S,238,true,"Tissue atlas Arabidopsis - ProteomicsDB",114,32188942,"MaxQuant score",176.9600000,0.8177270,,,,0,
