Peptide,PTM,ModifiedAA,ModifiedPosition,PeptideUniqueToGene,ExperimentDesc,ExpID,PubmedID,ScoreType,IdentScore,LocProb,Log2FChange,PQ-val,QuantSig,PEP,MassErrorPPM
FANASIEMSQTQESAIR,nt,F,58,true,"N-terminal ChaFRADIC",92,26010716,"MASCOT Score",55.2800000,,,,,3.1049999904553E-8,
SIEMSQTQESAIR,nt,S,62,true,"FtsH12 N-terminome: WT / FtsH12 knockdown miRNA",118,33216923,"MaxQuant score",47.7060000,,,,,0.038263998925686,
SQTQESAIRGAESDVMGLLLR,nt,S,66,true,"N-terminal ChaFRADIC",92,26010716,"MASCOT Score",55.0400000,,,,,2.3270000326647E-7,
SQTQESAIRGAESDVMGLL,nt,S,66,true,"Arabidopsis translation initiation landscape - NT",167b,35069635,,,,,,,,
SQTQESAIR,nt,S,66,true,"Tic56 chloroplast import - tic56-1",89c,25588737,XCorr,2.6152282,,,,,,
SQTQESAIR,nt,S,66,true,"N-terminal ChaFRADIC",92,26010716,"MASCOT Score",44.9300000,,,,,0.0079340003430843,
SQTQESAIR,nt,S,66,true,"Arg/N-end rule seed, prt6 vs. Wt",99,29168982,"MASCOT Score",50.0800000,,0.2160303,0.1389287,NO,0.014689999632537,-1.6420235
SQTQESAIR,nt,S,66,true,"FtsH12 N-terminome: WT / FtsH12 knockdown miRNA",118,33216923,"MaxQuant score",54.6720000,,,,,0.014037000015378,
SQTQESAIRGAESDVMGLLLR,nta,S,66,true,"N-terminal ChaFRADIC",92,26010716,"MASCOT Score",55.0400000,,,,,2.3270000326647E-7,
SQTQESAIRGAESDVMGLL,nta,S,66,true,"Arabidopsis translation initiation landscape - NTA",167a,35069635,,,,,,,,
SQTQESAIR,nta,S,66,true,"Characterization plant N-terminal acetylation",6,22223895,"MASCOT Score",76.1700000,,,,,,
SQTQESAIR,nta,S,66,true,"N-terminal ChaFRADIC",92,26010716,"MASCOT Score",44.9300000,,,,,0.0079340003430843,
SQTQESAIR,nta,S,66,true,"Arg/N-end rule seed, prt6 vs. Wt",99,29168982,"MASCOT Score",46.0200000,,,,,0.10760000348091,2.3452133
QTQESAIR,nt,Q,67,true,"N-terminal ChaFRADIC",92,26010716,"MASCOT Score",42.0100000,,,,,0.00020789999689441,
QTQESAIR,nt,Q,67,true,"Arg/N-end rule seed, prt6 vs. Wt",99,29168982,"MASCOT Score",44.8800000,,-0.0408108,0.5747759,NO,0.058400001376867,-0.7783285
AIYDVVQLVR,nt,A,136,true,"Arg/N-end rule seed, prt6 vs. Wt",99,29168982,"MASCOT Score",25.7400000,,-0.6483414,0.0017258,NO,0.050140000879765,6.7568078
GASGQAIDVE,nt,G,188,true,"Arg/N-end rule seed, prt6 vs. Wt",99,29168982,"MASCOT Score",38.5600000,,-0.8123260,0.1731902,NO,0.032669998705387,0.3455334
NNVTSIIAGCTSR,sno,C,217,true,"Site-specific nitrosomeproteomic id - gsnor1-3",90a,25699590,XCorr,3.9576819,,,,,1.1119999726361E-5,-6.6968543
NNVTSIIAGCTSR,sno,C,217,true,"Site-specific nitrosomeproteomic id - gsnor1-3",90b,25699590,XCorr,3.7900000,,,,,0.0055929999798536,-5.8800000
NNVTSIIAGCTSR,so,C,217,true,"Arabidopsis S-sulfenylation chemoproteomics",108,31578252,"pFind PSM Score",0.0000108,,1.0870400,,,,-0.3609308
NNVTSIIAGCTSR,so,C,217,true,"S-sulfenylation site detection using YAP1C",110,32714340,,,,,,,,
SFEQVLKDIDR,ac,K,227,true,"Histone deacetylases - apicidin vs control",98a,29061669,"MaxQuant Score",83.2000000,1.0000000,0.1300000,0.5081594,NO,5.5999998949119E-6,
SFEQVLKDIDR,ac,K,227,true,"Histone deacetylases substrates - TSA vs control",98b,29061669,"MaxQuant Score",83.2000000,1.0000000,0.4210000,0.8413951,NO,5.5999998949119E-6,
SFEQVLKDIDR,ac,K,227,true,"Histone deacetylases substrates - hda14 vs WT",98e,29061669,"MaxQuant Score",83.2000000,1.0000000,0.4710000,0.2018366,NO,3.7000001611887E-5,
