Peptide,PTM,ModifiedAA,ModifiedPosition,PeptideUniqueToGene,ExperimentDesc,ExpID,PubmedID,ScoreType,IdentScore,LocProb,Log2FChange,PQ-val,QuantSig,PEP,MassErrorPPM
SIESPLSSSTLK,ph,S,166,true,"atm and atr DNA damage response",88,25561503,"MASCOT Score",67.0000000,1.0000000,,,,,0.0000000
SIESPLSSSTLK,ph,S,166,true,"Tissue atlas Arabidopsis - ProteomicsDB",114,32188942,"MaxQuant score",184.5100000,1.0000000,,,,5.0619498530942E-20,
SIESPLSSSTLK,ph,S,169,true,"atm and atr DNA damage response",88,25561503,"MASCOT Score",77.0000000,1.0000000,,,,,-0.4600000
SIESPLSSSTLK,ph,S,169,true,"TOR Kinase and ABA Receptor",100,29290610,XCorr,3.9080536,1.0000000,,,,0.00028169999131933,
SIESPLSSSTLK,ph,S,169,true,"Lateral root-induction - NAA vs control",106,23328941,"MASCOT Score",35.0000000,,,,,,
SIESPLSSSTLK,ph,S,169,true,"Phospho cell culture sucrose/TOR",109,30833711,,,0.9999840,,,,,
SIESPLSSSTLK,ph,S,169,true,"Tissue atlas Arabidopsis - ProteomicsDB",114,32188942,"MaxQuant score",191.5300000,1.0000000,,,,2.8475299103318E-24,
SIESPLSSSTLK,ph,S,172,true,"atm and atr DNA damage response",88,25561503,"MASCOT Score",44.0000000,0.9190000,,,,,1.4900000
SIESPLSSSTLK,ph,S,172,true,"Tissue atlas Arabidopsis - ProteomicsDB",114,32188942,"MaxQuant score",130.1500000,0.8568500,,,,3.2828800613061E-5,
SIESPLSSSTLK,ph,S,173,true,"Tissue atlas Arabidopsis - ProteomicsDB",114,32188942,"MaxQuant score",184.5100000,0.8430320,,,,5.0619498530942E-20,
AAIESQQHSVLR,ph,S,186,true,"Tissue atlas Arabidopsis - ProteomicsDB",114,32188942,"MaxQuant score",52.5990000,0.9226040,,,,0.010679700411856,
AAIESQQHSVLR,ph,S,190,true,"atm and atr DNA damage response",88,25561503,"MASCOT Score",32.0000000,1.0000000,,,,,-0.9900000
AAIESQQHSVLR,ph,S,190,true,"Tissue atlas Arabidopsis - ProteomicsDB",114,32188942,"MaxQuant score",153.9400000,0.9999950,,,,8.0924298373475E-9,
LAPVSLDSIGIAESDHPGNGR,ph,S,202,true,"Tissue atlas Arabidopsis - ProteomicsDB",114,32188942,"MaxQuant score",82.4790000,0.9999990,,,,1.3724400105275E-6,
LAPVSLDSIGIAESDHPGNGR,ph,S,205,true,"Tissue atlas Arabidopsis - ProteomicsDB",114,32188942,"MaxQuant score",82.4790000,0.9997920,,,,1.3724400105275E-6,
DGYSLVFETLKKYSVTVK,ph,Y,567,true,"MAPK Arabidopsis substrates",45,23172892,"MaxQuant Score",79.6520000,,,,,,
DGYSLVFETLKKYSVTVK,ph,S,568,true,"MAPK Arabidopsis substrates",45,23172892,"MaxQuant Score",79.6520000,,,,,,
DGYSLVFETLKKYSVTVK,ph,T,573,true,"MAPK Arabidopsis substrates",45,23172892,"MaxQuant Score",79.6520000,,,,,,
DGYSLVFETLKKYSVTVK,ph,Y,577,true,"MAPK Arabidopsis substrates",45,23172892,"MaxQuant Score",79.6520000,,,,,,
