Peptide,PTM,ModifiedAA,ModifiedPosition,PeptideUniqueToGene,ExperimentDesc,ExpID,PubmedID,ScoreType,IdentScore,LocProb,Log2FChange,PQ-val,QuantSig,PEP,MassErrorPPM
VFEAFEVGTVPFN,nt,V,2,true,"HUNTER N-terminome: legumain, GluC and trypsin",119,31951383,"MaxQuant score",114.5000000,,,,,,
ALSNPSARPHTGSK,ph,S,62,true,"Phospho cell culture sucrose/TOR",109,30833711,,,0.9996170,,,,,
ALSNPSARPHTGSK,ph,S,62,true,"Tissue atlas Arabidopsis - ProteomicsDB",114,32188942,"MaxQuant score",61.0150000,0.9962200,,,,0.0008547609904781,
ALSNPSAR,ph,S,62,true,"atm and atr DNA damage response",88,25561503,"MASCOT Score",34.0000000,0.9990000,,,,,0.8200000
ALSNPSARPHTGSK,ph,T,70,true,"atm and atr DNA damage response",88,25561503,"MASCOT Score",38.0000000,0.9990000,,,,,0.2400000
ALSNPSARPHTGSK,ph,T,70,true,"TOR Kinase and ABA Receptor",100,29290610,XCorr,2.8882477,0.8916000,,,,0.013059999793768,
ALSNPSARPHTGSK,ph,T,70,true,"Lateral root-induction - NAA vs control",106,23328941,"MASCOT Score",26.0000000,,,,,,
ALSNPSARPHTGSK,ph,T,70,true,"Phospho cell culture sucrose/TOR",109,30833711,,,0.9627100,,,,,
ALSNPSARPHTGSK,ph,T,70,true,"Col-0 X-ray callus - FC Col-0 vs. Col-0 Xray",111b,31410901,,33.3900000,,0.0000000,0.0000000,NO,,0.2448740
ALSNPSARPHTGSK,ph,T,70,true,"atm callus - FC atm vs. atm Xray",111c,31410901,,33.3900000,,-1.4177034,0.0000000,NO,,0.2448740
ALSNPSARPHTGSK,ph,T,70,true,"atm-3 X-ray callus - FC atm vs. atm Xray",111d,31410901,,33.3900000,,-1.4177034,0.0000000,NO,,0.2448740
ALSNPSARPHTGSK,ph,T,70,true,"Tissue atlas Arabidopsis - ProteomicsDB",114,32188942,"MaxQuant score",163.4100000,0.9903690,,,,3.0954999674648E-10,
FAVDEGFGLTNSGGNADEDAAFR,nt,F,85,true,"Arabidopsis translation initiation landscape - NT",167b,35069635,,,,,,,,
DEEVEAKKR,ub,K,145,false,"Arabidopsis ubiquitination COFRADIC",40,26744219,"MaxQuant Score",95.5020000,1.0000000,,,,0.0040000001899898,0.3040000
DEEVEAKKR,ub,K,146,false,"Arabidopsis ubiquitination COFRADIC",40,26744219,"MaxQuant Score",95.5020000,1.0000000,,,,0.0040000001899898,0.3040000
GGLESYDR,nt,G,215,true,"Arg/N-end rule seed, prt6 vs. Wt",99,29168982,"MASCOT Score",41.8400000,,-0.4177010,0.0749111,NO,0.13099999725819,3.4480228
SFKVTTSDDLVIR,ph,S,242,true,"Tissue atlas Arabidopsis - ProteomicsDB",114,32188942,"MaxQuant score",190.1900000,1.0000000,,,,6.1187599311714E-30,
DGSPLDLLSVHETSQEPLPEGK,ph,S,303,true,"Tissue atlas Arabidopsis - ProteomicsDB",114,32188942,"MaxQuant score",84.5150000,0.9999840,,,,7.7914599216911E-9,
TSQEPLPE,nt,T,313,false,"N-terminal ChaFRADIC",92,26010716,"MASCOT Score",33.6300000,,,,,0.064599998295307,
TSQEPLPE,nt,T,313,false,"Arg/N-end rule seed, prt6 vs. Wt",99,29168982,"MASCOT Score",37.8600000,,0.0325387,0.8507039,NO,0.034230001270771,-0.3912135
CELQSTVDLNNQR,so,C,391,true,"S-sulfenylation site detection using YAP1C",110,32714340,,,,,,,,
ELQSTVDLNNQR,nt,E,392,true,"Arg/N-end rule seed, prt6 vs. Wt",99,29168982,"MASCOT Score",35.8600000,,-0.0517654,0.4136130,NO,0.035719998180866,-0.8727621
SFLTLNALNEFDPK,ph,T,407,false,"SIRK1 phosphorylation",86a,23820729,"MaxQuant Score",73.1690000,0.9980000,,,,0.94300001859665,7.1180000
SFLTLNALNEFDPK,ph,T,407,false,"SIRK1 exp - sirk1 mutant vs WT",86b,23820729,,,,-0.1309243,,NO,,
SFLTLNALNEFDPK,ph,T,407,false,"SIRK1 exp - 35S:SIRK1 vs WT",86c,23820729,,,,-4.5371514,,NO,,
SIVDLCMK,so,C,512,false,"S-sulfenylation site detection using YAP1C",110,32714340,,,,,,,,
