Peptide,PTM,ModifiedAA,ModifiedPosition,PeptideUniqueToGene,ExperimentDesc,ExpID,PubmedID,ScoreType,IdentScore,LocProb,Log2FChange,PQ-val,QuantSig,PEP,MassErrorPPM
INSSRIDDSSQTK,ph,S,30,true,"TOR Kinase and ABA Receptor",100,29290610,XCorr,3.6654897,0.9994000,,,,0.0027679998893291,
LIESEKFSSSR,ph,S,54,true,"Tissue atlas Arabidopsis - ProteomicsDB",114,32188942,"MaxQuant score",65.2340000,0.9999560,,,,0.0046557998284698,
LIESEKFSSSR,ph,S,58,true,"Tissue atlas Arabidopsis - ProteomicsDB",114,32188942,"MaxQuant score",214.4200000,0.8174160,,,,6.2415299952744E-32,
LIESEKFSSSR,ph,S,59,true,"Chloroplast kinase substrates",60,19376835,"MASCOT Score",39.7700000,,,,,,-1.7287500
FSSSRFSEK,ph,S,59,true,"TOR Kinase and ABA Receptor",100,29290610,XCorr,2.1878443,0.8743000,,,,0.094329997897148,
FSSSRFSEK,ph,S,59,true,"Tissue atlas Arabidopsis - ProteomicsDB",114,32188942,"MaxQuant score",214.4200000,0.9995100,,,,6.2415299952744E-32,
FSSSRFSEK,ph,S,63,true,"Tissue atlas Arabidopsis - ProteomicsDB",114,32188942,"MaxQuant score",113.6100000,0.9997750,,,,0.00033855301444419,
HQEIAEIGDTDEDEDDDHHPPEELKR,ph,T,75,true,"Plasmamembrane phosphorylation",20,15308754,,,,,,,,
HQEIAEIGDTDEDEDDDHHPPEELKR,ph,T,75,true,"Tissue atlas Arabidopsis - ProteomicsDB",114,32188942,"MaxQuant score",169.1800000,1.0000000,,,,0,
HQEIAEIGDTDEDEDDDHHPPEELK,ph,T,75,true,"Phosphorylation Early Elicitor Signaling",23,17317660,,,,,,,,
HQEIAEIGDTDEDEDDDHHPPEELK,ph,T,75,true,"TOR Kinase and ABA Receptor",100,29290610,XCorr,4.3501110,1.0000000,,,,1.532000055704E-6,
HQEIAEIGDTDEDEDDDHHPPEELK,ph,T,75,true,"Phospho cell culture sucrose/TOR",109,30833711,,,1.0000000,,,,,
REPSVVIPPSPETVSK,ph,S,94,true,"atm and atr DNA damage response",88,25561503,"MASCOT Score",23.0000000,1.0000000,,,,,0.8500000
EPSVVIPPSPETVSK,ph,S,94,true,"Tissue atlas Arabidopsis - ProteomicsDB",114,32188942,"MaxQuant score",78.8140000,0.9872590,,,,8.0203702964354E-5,
REPSVVIPPSPETVSK,ph,S,100,true,"atm and atr DNA damage response",88,25561503,"MASCOT Score",23.0000000,1.0000000,,,,,0.8500000
EPSVVIPPSPETVSK,ph,S,100,true,"Tissue atlas Arabidopsis - ProteomicsDB",114,32188942,"MaxQuant score",153.2000000,0.9628020,,,,1.8966199721859E-9,
IADFGLATFFDPQNCVPLTSR,ph,T,295,true,"Phosphorylation Early Elicitor Signaling",23,17317660,,,,,,,,
IADFGLATFFDPQNCVPLTSR,ph,T,295,true,"TOR Kinase and ABA Receptor",100,29290610,XCorr,5.6115370,0.9079000,,,,2.3420000161423E-8,
SCVPGNSQR,ph,S,503,true,"Tissue atlas Arabidopsis - ProteomicsDB",114,32188942,"MaxQuant score",74.5330000,0.9999990,,,,0.0066905100829899,
VSHSGPMMK,ph,S,523,true,"Phospho cell culture sucrose/TOR",109,30833711,,,0.9991530,,,,,
ANSAGQGGGYVGSDQQMMDQQR,ph,S,553,true,"Tissue atlas Arabidopsis - ProteomicsDB",114,32188942,"MaxQuant score",86.7610000,0.9999980,,,,3.0264699635296E-9,
TFNRADTMDNSK,ph,T,583,true,"TOR Kinase and ABA Receptor",100,29290610,XCorr,3.8053770,1.0000000,,,,0.00458599999547,
ADTMDNSKR,ph,T,583,true,"atm and atr DNA damage response",88,25561503,"MASCOT Score",29.0000000,1.0000000,,,,,-4.2100000
ADTMDNSK,ph,T,583,true,"atm and atr DNA damage response",88,25561503,"MASCOT Score",47.0000000,1.0000000,,,,,-2.0700000
MYMSGPLLAQPR,ph,S,610,true,"Plasmamembrane phosphorylation",20,15308754,,,,,,,,
MYMSGPLLAQPR,ph,S,610,true,"atm and atr DNA damage response",88,25561503,"MASCOT Score",38.0000000,0.9430000,,,,,0.4100000
MYMSGPLLAQPR,ph,S,610,true,"TOR Kinase and ABA Receptor",100,29290610,XCorr,2.8365262,0.9992000,,,,0.0041579999960959,
MYMSGPLLAQPR,ph,S,610,true,"Phospho cell culture sucrose/TOR",109,30833711,,,0.9999980,,,,,
MYMSGPLLAQPR,ph,S,610,true,"Tissue atlas Arabidopsis - ProteomicsDB",114,32188942,"MaxQuant score",160.1800000,1.0000000,,,,1.4427900540959E-10,
