Peptide,PTM,ModifiedAA,ModifiedPosition,PeptideUniqueToGene,ExperimentDesc,ExpID,PubmedID,ScoreType,IdentScore,LocProb,Log2FChange,PQ-val,QuantSig,PEP,MassErrorPPM
ASLFKEQAKL,nt,A,2,true,"N-term acetylation drought responses",5,26184543,,,,,,,,
ASLFKEQAKL,nt,A,2,true,"Arg/N-end rule seed, prt6 vs. Wt",99,29168982,"MASCOT Score",27.7500000,,,,,0.037719998508692,-1.6508210
ASLFKEQAKLSAYR,nta,A,2,true,"Arg/N-end rule pathway Roots",80,25728785,"MASCOT Score",36.0800000,,,,,0.00033060001442209,
ASLFKEQAKLSAYR,nta,A,2,true,"Arabidopsis translation initiation landscape - NTA",167a,35069635,,,,,,,,
ASLFKEQAKL,nta,A,2,true,"N-term acetylation drought responses",5,26184543,,,,,,,,
ASLFKEQAKL,nta,A,2,true,"Arg/N-end rule pathway Roots",80,25728785,"MASCOT Score",28.3600000,,,,,0.0020880000665784,
ASLFKEQAKL,nta,A,2,true,"Arg/N-end rule seed, prt6 vs. Wt",99,29168982,"MASCOT Score",27.7500000,,0.1127367,0.3856691,NO,0.037719998508692,-1.6508210
RFSGTQEEFDEALR,ph,S,20,true,"Large-scale phosphorylation discovery",44,23111157,XCorr,4.2550000,,,,,,
RFSGTQEEFDEALR,ph,S,20,true,"Tissue atlas Arabidopsis - ProteomicsDB",114,32188942,"MaxQuant score",207.3100000,0.9992780,,,,6.2684396308519E-39,
LVQKELEAQR,ub,K,149,true,"upl3 mutant / wildtype",168,35926874,"MaxQuant score",74.8410000,1.0000000,0.1230040,,,0.006050200201571,-1.4551000
FRESGDSDDDGEDDRKR,ph,S,242,true,"atm and atr DNA damage response",88,25561503,"MASCOT Score",27.0000000,1.0000000,,,,,0.0900000
FRESGDSDDDGEDDRK,ph,S,242,true,"Tyrosine phosphorylation in Arabidopsis",59,18463617,"MASCOT Score",29.0000000,,,,,,-0.5724113
FRESGDSDDDGEDDRK,ph,S,242,true,"TOR Kinase and ABA Receptor",100,29290610,XCorr,4.6401906,1.0000000,,,,4.0700000681682E-5,
FRESGDSDDDGEDDR,ph,S,242,true,"atm and atr DNA damage response",88,25561503,"MASCOT Score",39.0000000,1.0000000,,,,,-0.4000000
FRESGDSDDDGEDDRKR,ph,S,245,true,"atm and atr DNA damage response",88,25561503,"MASCOT Score",30.0000000,0.9930000,,,,,0.8500000
FRESGDSDDDGEDDRK,ph,S,245,true,"Tyrosine phosphorylation in Arabidopsis",59,18463617,"MASCOT Score",64.0000000,,,,,,-1.0927857
FRESGDSDDDGEDDRK,ph,S,245,true,"Conserved plant phosphoproteome - Arabidopsis",61a,20466843,"MASCOT Score",29.0000000,1.0000000,,,,,
FRESGDSDDDGEDDRK,ph,S,245,true,"srk2dei ABA signaling phopshoproteomics",83,23572148,"MASCOT Score",52.0000000,,,,,,-0.0006000
FRESGDSDDDGEDDRK,ph,S,245,true,"SnRK2 protein kinase substrates",85,23776212,XCorr,4.0706511,0.8890000,,,,0.0061436900869012,
FRESGDSDDDGEDDRK,ph,S,245,true,"TOR Kinase and ABA Receptor",100,29290610,XCorr,4.6401906,1.0000000,,,,4.0700000681682E-5,
FRESGDSDDDGEDDR,ph,S,245,true,"STN8 phosphoproteome",38,21768351,"MASCOT Score",105.9900000,,,,,,-1.0733800
FRESGDSDDDGEDDR,ph,S,245,true,"Chloroplast kinase substrates",60,19376835,"MASCOT Score",106.6300000,,,,,,-1.2961500
FRESGDSDDDGEDDR,ph,S,245,true,"LAXIC - ABA stress",84a,23660473,XCorr,3.0000000,0.9980000,,,,0.078213103115559,
FRESGDSDDDGEDDR,ph,S,245,true,"LAXIC - mannitol vs control",84b,23660473,XCorr,4.2600000,1.0000000,,,,0.0011281899642199,
FRESGDSDDDGEDDR,ph,S,245,true,"SnRK2 protein kinase substrates",85,23776212,XCorr,4.4312539,1.0000000,,,,0.0030916400719434,
FRESGDSDDDGEDDR,ph,S,245,true,"atm and atr DNA damage response",88,25561503,"MASCOT Score",67.0000000,1.0000000,,,,,0.0000000
FRESGDSDDDGEDDR,ph,S,245,true,"Phospho cell culture sucrose/TOR",109,30833711,,,0.9997540,,,,,
FRESGDSDDDGEDDR,ph,S,245,true,"Col-0 callus - FC Col-0 vs. Col-0 Xray",111a,31410901,,68.4200000,,1.1628597,0.0000000,NO,,0.6129391
FRESGDSDDDGEDDR,ph,S,245,true,"Col-0 X-ray callus - FC Col-0 vs. Col-0 Xray",111b,31410901,,68.4200000,,1.1628597,0.0000000,NO,,0.6129391
FRESGDSDDDGEDDR,ph,S,245,true,"atm callus - FC atm vs. atm Xray",111c,31410901,,68.4200000,,,0.0000000,NO,,0.6129391
ESGDSDDDGEDDRKR,ph,S,245,true,"STN8 phosphoproteome",38,21768351,"MASCOT Score",63.0800000,,,,,,-0.1304610
ESGDSDDDGEDDRKR,ph,S,245,true,"Chloroplast kinase substrates",60,19376835,"MASCOT Score",41.5100000,,,,,,-0.5861190
ESGDSDDDGEDDRKR,ph,S,245,true,"atm and atr DNA damage response",88,25561503,"MASCOT Score",68.0000000,0.9980000,,,,,-0.5400000
ESGDSDDDGEDDRK,ph,S,245,true,"atm and atr DNA damage response",88,25561503,"MASCOT Score",34.0000000,1.0000000,,,,,0.4000000
