Peptide,PTM,ModifiedAA,ModifiedPosition,PeptideUniqueToGene,ExperimentDesc,ExpID,PubmedID,ScoreType,IdentScore,LocProb,Log2FChange,PQ-val,QuantSig,PEP,MassErrorPPM
SLKAPNLNGYCESWR,nt,S,46,true,"Arg/N-end rule pathway Roots",80,25728785,"MASCOT Score",43.3200000,,,,,7.000000186963E-5,
SLKAPNLNGYCESWR,nt,S,46,true,"FtsH12 N-terminome: WT / FtsH12 knockdown miRNA",118,33216923,"MaxQuant score",113.6200000,,,,,0.004796199966222,
SLKAPNLNGYCE,nt,S,46,true,"Arg/N-end rule seed, prt6 vs. Wt",99,29168982,"MASCOT Score",28.8000000,,-0.2301995,0.1379334,NO,0.0011830000439659,0.2361656
LKAPNLNGYCESWR,nt,L,47,true,"Arg/N-end rule pathway Roots",80,25728785,"MASCOT Score",39.3500000,,,,,0.00014950000331737,
LKAPNLNGYCESWR,nt,L,47,true,"HUNTER N-terminome: legumain, GluC and trypsin",119,31951383,"MaxQuant score",75.4620000,,,,,,
LKAPNLNGYCESWR,nta,L,47,true,"FtsH12 N-terminome: WT / FtsH12 knockdown miRNA",118,33216923,"MaxQuant score",89.3010000,,,,,0.00054777000332251,
APNLNGYCESWR,nt,A,49,true,"Arg/N-end rule pathway Roots",80,25728785,"MASCOT Score",65.0500000,,,,,0.0007317999843508,
APNLNGYCESWR,nt,A,49,true,"Arg/N-end rule seed, prt6 vs. Wt",99,29168982,"MASCOT Score",58.8800000,,-0.1867325,0.5344054,NO,0.0047189998440444,-0.3103369
APNLNGYCESWR,nt,A,49,true,"HUNTER N-terminome: legumain, GluC and trypsin",119,31951383,"MaxQuant score",134.3000000,,,,,,
APNLNGYCE,nt,A,49,true,"Arg/N-end rule seed, prt6 vs. Wt",99,29168982,"MASCOT Score",51.4000000,,-0.0601188,0.8292276,NO,0.00074719998519868,-1.0261053
APNLNGYCESWR,nta,A,49,true,"FtsH12 N-terminome: WT / FtsH12 knockdown miRNA",118,33216923,"MaxQuant score",128.3500000,,,,,3.0499999411404E-5,
TSSQYEDDVER,nt,T,87,true,"Arg/N-end rule pathway Roots",80,25728785,"MASCOT Score",64.3600000,,,,,0.00066040002275258,
TSSQYEDDVER,nt,T,87,true,"Tic56 chloroplast import - tic56-1",89c,25588737,XCorr,2.6638424,,,,,,
TSSQYEDDVER,nt,T,87,true,"Arg/N-end rule seed, prt6 vs. Wt",99,29168982,"MASCOT Score",45.2700000,,-1.3240741,0.1202615,NO,0.040389999747276,-4.6911377
SSQYEDDVER,nt,S,88,true,"Arg/N-end rule seed, prt6 vs. Wt",99,29168982,"MASCOT Score",64.6600000,,-1.2593152,0.0163442,YES,0.00051330000860617,-1.5308844
SNGCFGGEQLNTTKFEEWQNSGK,ng,N,149,true,"Conserved N-glycosylation",74,22633491,"MaxQuant Score",257.5800000,1.0000000,,,,0,2.5190000
SNGCFGGEQLNTTK,ng,N,149,true,"UDP-GlcNAc transporter glycopeptide analysis",135,30224661,,,,,,,8.4258233723489E-10,0.9000000
SVSQYKADLR,ac,K,227,true,"Quantitative Acetylproteomics",101,29440448,,,,,,,,
