Peptide,PTM,ModifiedAA,ModifiedPosition,PeptideUniqueToGene,ExperimentDesc,ExpID,PubmedID,ScoreType,IdentScore,LocProb,Log2FChange,PQ-val,QuantSig,PEP,MassErrorPPM
ATQGQVITCKAAVAYEPNKPLVIEDVQVAPPQAGEVR,nt,A,2,true,"Stromal N-terminome",96,26371235,"MASCOT Score",70.4000000,,,,,,
ATQGQVITCK,nt,A,2,true,"N-term acetylation drought responses",5,26184543,,,,,,,,
ATQGQVITCK,nt,A,2,true,"Arg/N-end rule seed, prt6 vs. Wt",99,29168982,"MASCOT Score",20.4400000,,,,,0.00024600001052022,-2.5089426
ATQGQVITC,nt,A,2,true,"Arg/N-end rule seed, prt6 vs. Wt",99,29168982,"MASCOT Score",27.4600000,,,,,0.15800000727177,0.0522955
ATQGQVITCKAAVAYEPNKPLVIEDVQVAPPQAGEVR,nta,A,2,true,"Stromal N-terminome",96,26371235,"MASCOT Score",70.4000000,,,,,,
ATQGQVITCKAAVAYEPNKPLVIE,nta,A,2,true,"HUNTER N-terminome: legumain, GluC and trypsin",119,31951383,"MaxQuant score",193.5000000,,,,,,
ATQGQVITCKAAVAYEPNKPLVIE,nta,A,2,true,"Arabidopsis translation initiation landscape - NTA",167a,35069635,,,,,,,,
ATQGQVITCKAAVAYEPN,nta,A,2,true,"HUNTER N-terminome: legumain, GluC and trypsin",119,31951383,"MaxQuant score",67.0950000,,,,,,
ATQGQVITCKAAVAYE,nta,A,2,true,"HUNTER N-terminome: legumain, GluC and trypsin",119,31951383,"MaxQuant score",66.0230000,,,,,,
ATQGQVITCK,nta,A,2,true,"N-term acetylation drought responses",5,26184543,,,,,,,,
ATQGQVITCK,nta,A,2,true,"Characterization plant N-terminal acetylation",6,22223895,"MASCOT Score",75.9500000,,,,,,
ATQGQVITCK,nta,A,2,true,"Arg/N-end rule seed, prt6 vs. Wt",99,29168982,"MASCOT Score",20.4400000,,-0.0031439,0.9871881,NO,0.00024600001052022,-2.5089426
ATQGQVITC,nta,A,2,true,"Arg/N-end rule seed, prt6 vs. Wt",99,29168982,"MASCOT Score",27.4600000,,,,,0.15800000727177,0.0522955
ATQGQVITCK,ox,C,10,true,"SPEAR - 10 mM H2O2 / mock",138a,34619326,,,,2.2745103,0.0200585,YES,,
ATQGQVITCK,so,C,10,true,"S-sulfenylation site detection using YAP1C",110,32714340,,,,,,,,
TALCHTDAYTWSGK,so,C,47,true,"Arabidopsis S-sulfenylation chemoproteomics",108,31578252,"pFind PSM Score",0.0004487,,1.1494300,,,,-1.0989768
AYTWSGKDPE,nt,A,51,true,"Arg/N-end rule seed, prt6 vs. Wt",99,29168982,"MASCOT Score",20.3500000,,-0.4292419,0.2664737,NO,0.0097580002620816,-0.0268249
SVGEGVTEVQ,nt,S,77,true,"N-terminal ChaFRADIC",92,26010716,"MASCOT Score",80.7300000,,,,,1.2210000477353E-7,
SVGEGVTE,nt,S,77,true,"N-terminal ChaFRADIC",92,26010716,"MASCOT Score",57.8700000,,,,,0.066480003297329,
TNLCGK,sno,C,113,false,"hot5-4 / wildtype, FAT-switch S-nitrosoproteome",169,37277371,,,,,,,,
TNLCGK,so,C,113,false,"S-sulfenylation site detection using YAP1C",110,32714340,,,,,,,,
SATGVGIMMNDR,nt,S,118,true,"Arabidopsis translation initiation landscape - NT",167b,35069635,,,,,,,,
SATGVGIM,nt,S,118,true,"Arg/N-end rule seed, prt6 vs. Wt",99,29168982,"MASCOT Score",44.1200000,,-0.4278433,0.0128784,NO,0.11169999837875,-1.1401889
IDPTAPLDKVCLLGCGVPTGLGAVWNTAK,ub,K,171,true,"Arabidopsis ubiquitination by TUBEs",2,23667124,,,,,,,,
KFGVNEFVNPK,ub,K,237,true,"upl3 mutant / wildtype",168,35926874,"MaxQuant score",136.7000000,1.0000000,0.5280712,0.3162200,NO,4.9128900059259E-8,1.0809000
AALECCHK,so,C,284,true,"Arabidopsis S-sulfenylation chemoproteomics",108,31578252,"pFind PSM Score",0.1451140,,1.3516000,,,,0.0511284
AALECCHK,so,C,285,true,"Arabidopsis S-sulfenylation chemoproteomics",108,31578252,"pFind PSM Score",0.1451140,,,,,,0.0511284
GTAFGGFKSR,ac,K,326,true,"Quantitative Acetylproteomics",101,29440448,,,,,,,,
TQVPWLVEKYMNK,ub,K,337,true,"upl3 mutant / wildtype",168,35926874,"MaxQuant score",76.7280000,1.0000000,-0.6438562,,,0.00011494500358822,1.4925000
AFDLLHEGTCLR,sno,C,370,true,"hot5-4 / wildtype, FAT-switch S-nitrosoproteome",169,37277371,,,,,,,,
AFDLLHEGTCLR,so,C,370,true,"Arabidopsis S-sulfenylation chemoproteomics",108,31578252,"pFind PSM Score",0.0002526,,0.9991700,,,,-1.0517932
AFDLLHEGTCLR,so,C,370,true,"S-sulfenylation site detection using YAP1C",110,32714340,,,,,,,,
CVLDTSK,ox,C,373,true,"OxiTRAQ Arabidopsis - 5 mM H2O2 versus control",47,24376095,,,,-0.0461199,0.6871278,NO,,
CVLDTSK,sno,C,373,true,"hot5-4 / wildtype, FAT-switch S-nitrosoproteome",169,37277371,,,,,,,,
CVLDTSK,so,C,373,true,"S-sulfenylation site detection using YAP1C",110,32714340,,,,,,,,
