Peptide,PTM,ModifiedAA,ModifiedPosition,PeptideUniqueToGene,ExperimentDesc,ExpID,PubmedID,ScoreType,IdentScore,LocProb,Log2FChange,PQ-val,QuantSig,PEP,MassErrorPPM
ALEAWFMDDSNEDQR,nt,A,2,true,"Tic56 chloroplast import - ppi2",89b,25588737,XCorr,4.3397360,,,,,,
ALEAWFMDDSNEDQR,nt,A,2,true,"Tic56 chloroplast import - tic56-1",89c,25588737,XCorr,3.9236052,,,,,,
ALEAWFMDDSNEDQR,nt,A,2,true,"Stromal N-terminome",96,26371235,"MASCOT Score",55.7000000,,,,,,
ALEAWFMDDSNEDQR,nta,A,2,true,"Characterization plant N-terminal acetylation",6,22223895,"MASCOT Score",57.7500000,,,,,,
ALEAWFMDDSNEDQR,nta,A,2,true,"Tic56 chloroplast import - ppi2",89b,25588737,XCorr,4.3397360,,,,,,
ALEAWFMDDSNEDQR,nta,A,2,true,"Tic56 chloroplast import - tic56-1",89c,25588737,XCorr,3.9236052,,,,,,
ALEAWFMDDSNEDQR,nta,A,2,true,"Stromal N-terminome",96,26371235,"MASCOT Score",55.7000000,,,,,,
ALEAWFMDDSNEDQR,nta,A,2,true,"HUNTER N-terminome: legumain, GluC and trypsin",119,31951383,"MaxQuant score",122.5100000,,,,,,
GYDYMDLLDLCPEK,so,C,71,true,"S-sulfenylation site detection using YAP1C",110,32714340,,,,,,,,
YIHGLTYK,ph,T,177,true,"atm and atr DNA damage response",88,25561503,"MASCOT Score",26.0000000,1.0000000,,,,,-2.2800000
