Peptide,PTM,ModifiedAA,ModifiedPosition,PeptideUniqueToGene,ExperimentDesc,ExpID,PubmedID,ScoreType,IdentScore,LocProb,Log2FChange,PQ-val,QuantSig,PEP,MassErrorPPM
AHGGYAKRR,nt,A,2,true,"Arabidopsis translation initiation landscape - NT",167b,35069635,,,,,,,,
RDSEPKQTAGSSR,ub,K,15,true,"Arabidopsis ubiquitination COFRADIC",40,26744219,"MaxQuant Score",43.7610000,1.0000000,,,,0.0099999997764826,0.1330000
KDLPPEVR,ub,K,51,false,"Arabidopsis ubiquitination COFRADIC",40,26744219,"MaxQuant Score",76.0640000,1.0000000,,,,0.026000000536442,0.6480000
LKEDLEYVR,ub,K,130,false,"Arabidopsis ubiquitination COFRADIC",40,26744219,"MaxQuant Score",66.2700000,1.0000000,,,,0.0020000000949949,1.4760000
ATSGMSSDER,ph,S,237,true,"atm and atr DNA damage response",88,25561503,"MASCOT Score",38.0000000,1.0000000,,,,,1.2800000
ATSGMSSDER,ph,S,238,true,"atm and atr DNA damage response",88,25561503,"MASCOT Score",38.0000000,1.0000000,,,,,1.2800000
NQKQNSDR,me1,K,244,true,"Arabidopsis protein methylome",123,31809900,"MaxQuant Score",134.2500000,1.0000000,,,,5.7239698815223E-21,0.6599900
ASAANSYSSQSSNLSSNSDAHKPK,ph,S,306,true,"Tissue atlas Arabidopsis - ProteomicsDB",114,32188942,"MaxQuant score",256.7000000,0.7963410,,,,0,
