Peptide,PTM,ModifiedAA,ModifiedPosition,PeptideUniqueToGene,ExperimentDesc,ExpID,PubmedID,ScoreType,IdentScore,LocProb,Log2FChange,PQ-val,QuantSig,PEP,MassErrorPPM
AAEGEVIACHTVEDWTEKLKAAN,nt,A,2,true,"Stromal N-terminome",96,26371235,"MASCOT Score",38.7900000,,,,,,
AAEGEVIACHTVEDWTEKLK,nt,A,2,true,"Stromal N-terminome",96,26371235,"MASCOT Score",55.8400000,,,,,,
AAEGEVIACH,nt,A,2,true,"Stromal N-terminome",96,26371235,"MASCOT Score",54.1600000,,,,,,
AAEGEVIACH,nt,A,2,true,"Arg/N-end rule seed, prt6 vs. Wt",99,29168982,"MASCOT Score",67.9500000,,-0.1238300,0.4547238,NO,0.007145999930799,-0.4803532
AAEGEVIAC,nt,A,2,true,"Arg/N-end rule seed, prt6 vs. Wt",99,29168982,"MASCOT Score",58.2700000,,,,,0.010839999653399,-1.3733785
AAEGEVIACHTVEDWTEKLKAANESKKL,nta,A,2,true,"Arabidopsis translation initiation landscape - NTA",167a,35069635,,,,,,,,
AAEGEVIACHTVEDWTEKLKAAN,nta,A,2,true,"Stromal N-terminome",96,26371235,"MASCOT Score",38.7900000,,,,,,
AAEGEVIACHTVEDWTEKLKAAN,nta,A,2,true,"HUNTER N-terminome: legumain, GluC and trypsin",119,31951383,"MaxQuant score",135.2100000,,,,,,
AAEGEVIACHTVEDWTEKLK,nta,A,2,true,"Arg/N-end rule pathway Roots",80,25728785,"MASCOT Score",48.5200000,,,,,0.00046489998931065,
AAEGEVIACHTVEDWTEKLK,nta,A,2,true,"Stromal N-terminome",96,26371235,"MASCOT Score",55.8400000,,,,,,
AAEGEVIACHTVEDWTEK,nta,A,2,true,"Characterization plant N-terminal acetylation",6,22223895,"MASCOT Score",93.7300000,,,,,,
AAEGEVIACHTVEDWTEK,nta,A,2,true,"Arg/N-end rule pathway Roots",80,25728785,"MASCOT Score",97.2600000,,,,,3.9119998906934E-10,
AAEGEVIACHTVED,nta,A,2,true,"HUNTER N-terminome: legumain, GluC and trypsin",119,31951383,"MaxQuant score",174.9800000,,,,,,
AAEGEVIACH,nta,A,2,true,"Arg/N-end rule pathway Roots",80,25728785,"MASCOT Score",53.4600000,,,,,0.00017410000145901,
AAEGEVIACH,nta,A,2,true,"Stromal N-terminome",96,26371235,"MASCOT Score",54.1600000,,,,,,
AAEGEVIACH,nta,A,2,true,"Arg/N-end rule seed, prt6 vs. Wt",99,29168982,"MASCOT Score",67.9500000,,,,,0.007145999930799,-0.4803532
AAEGEVIAC,nta,A,2,true,"Arg/N-end rule seed, prt6 vs. Wt",99,29168982,"MASCOT Score",40.8400000,,,,,0.11810000240803,-0.6007964
AAEGEVIACHTVEDWTEKLK,so,C,10,true,"S-sulfenylation site detection using YAP1C",110,32714340,,,,,,,,
AAEGEVIACHTVEDWTEKLK,ub,K,19,true,"upl3 mutant / wildtype",168,35926874,"MaxQuant score",144.7200000,1.0000000,,,,5.4292399860334E-17,1.6055000
FIAPVFADLAKK,ub,K,54,true,"Ubiquitination Membrane Proteins",120,33585938,,,,,,,,
FIAPVFADLAKK,ub,K,54,true,"upl3 mutant / wildtype",168,35926874,"MaxQuant score",84.4790000,1.0000000,-0.0394883,,,0.00013363799371291,-0.1311400
KHLDVVFFK,ac,K,55,true,"Quantitative Acetylproteomics",101,29440448,,,,,,,,
KHLDVVFFK,ub,K,55,true,"upl3 mutant / wildtype",168,35926874,"MaxQuant score",123.9600000,1.0000000,-0.9105018,0.2090200,NO,0.0030921199359,-1.2775000
VQAMPTFIFMK,mox,M,81,true,"cat2 Methionine oxidation - 1h stress",62a,25693801,"MASCOT Score",32.0000000,,0.0646382,,NO,,
VQAMPTFIFMK,mox,M,87,true,"cat2 Methionine oxidation - 1h stress",62a,25693801,"MASCOT Score",32.0000000,,0.0646382,,NO,,
EGEIKETVVGAAK,cr,K,93,true,"Open search Plant PTM Viewer 2.0 - Crotonylation",164c,TBA,,,,,,,,
ETVVGAAKEEIIANLEK,ub,K,101,true,"upl3 mutant / wildtype",168,35926874,"MaxQuant score",114.5600000,1.0000000,-1.7321646,,,1.9995300970521E-9,0.3027600
EEIIANLEKHK,ac,K,110,true,"Quantitative Acetylproteomics",101,29440448,,,,,,,,
EEIIANLEKHK,ub,K,110,true,"upl3 mutant / wildtype",168,35926874,"MaxQuant score",110.7400000,1.0000000,,,,3.5734701668844E-5,0.2045300
