Peptide,PTM,ModifiedAA,ModifiedPosition,PeptideUniqueToGene,ExperimentDesc,ExpID,PubmedID,ScoreType,IdentScore,LocProb,Log2FChange,PQ-val,QuantSig,PEP,MassErrorPPM
MDEALTNASAIGDQRQKIEQYKL,nta,M,1,true,"Arabidopsis translation initiation landscape - NTA",167a,35069635,,,,,,,,
MDEALTNASAIGDQRQKIE,nta,M,1,true,"N-terminal ChaFRADIC",92,26010716,"MASCOT Score",42.9000000,,,,,1.0069999916595E-5,
MDEALTNASAIGDQR,nta,M,1,true,"Characterization plant N-terminal acetylation",6,22223895,"MASCOT Score",92.3600000,,,,,,
MDEALTNASAIGDQR,nta,M,1,true,"Arg/N-end rule pathway Roots",80,25728785,"MASCOT Score",75.9400000,,,,,1.0759999895527E-5,
MDEALTNASAIGDQR,nta,M,1,true,"Tic56 chloroplast import - ppi2",89b,25588737,XCorr,3.2542343,,,,,,
MDEALTNASAIGDQR,nta,M,1,true,"Arg/N-end rule seed, prt6 vs. Wt",99,29168982,"MASCOT Score",102.3300000,,,,,9.0369998360984E-5,-1.2902768
MDEALTNASAIGDQR,nta,M,1,true,"FtsH12 N-terminome: WT / FtsH12 knockdown miRNA",118,33216923,"MaxQuant score",125.2500000,,,,,0.016673000529408,
MDEALTNASAIGDQR,nta,M,1,true,"HUNTER N-terminome: legumain, GluC and trypsin",119,31951383,"MaxQuant score",126.1000000,,,,,,
MDEALTNASA,nta,M,1,true,"N-term acetylation drought responses",5,26184543,,,,,,,,
MDEALTNASAIGDQR,ph,T,6,true,"SIRK1 phosphorylation",86a,23820729,"MaxQuant Score",71.5940000,1.0000000,,,,1.0789999961853,5.0270000
MDEALTNASAIGDQR,ph,T,6,true,"SIRK1 exp - sirk1 mutant vs WT",86b,23820729,,,,0.0617094,,NO,,
MDEALTNASAIGDQR,ph,T,6,true,"SIRK1 exp - 35S:SIRK1 vs WT",86c,23820729,,,,-2.5084644,,NO,,
MDEALTNASAIGDQR,ph,S,9,true,"SIRK1 phosphorylation",86a,23820729,"MaxQuant Score",71.5940000,1.0000000,,,,1.0789999961853,5.0270000
MDEALTNASAIGDQR,ph,S,9,true,"SIRK1 exp - sirk1 mutant vs WT",86b,23820729,,,,0.0617094,,NO,,
MDEALTNASAIGDQR,ph,S,9,true,"SIRK1 exp - 35S:SIRK1 vs WT",86c,23820729,,,,-2.5084644,,NO,,
QLLQSFAQELGR,nt,Q,56,true,"HUNTER N-terminome: legumain, GluC and trypsin",119,31951383,"MaxQuant score",105.8600000,,,,,,
