Peptide,PTM,ModifiedAA,ModifiedPosition,PeptideUniqueToGene,ExperimentDesc,ExpID,PubmedID,ScoreType,IdentScore,LocProb,Log2FChange,PQ-val,QuantSig,PEP,MassErrorPPM
ANTQLKSDAIMDMMKEH,nt,A,2,true,"Arg/N-end rule seed, prt6 vs. Wt",99,29168982,"MASCOT Score",60.3900000,,,,,4.3910000613323E-7,-4.3594696
ANTQLKSDAIMDMMKE,nt,A,2,true,"Arg/N-end rule seed, prt6 vs. Wt",99,29168982,"MASCOT Score",40.6000000,,,,,0.0013379999436438,-5.6086356
ANTQLKSDAIMDMM,nt,A,2,true,"Arg/N-end rule seed, prt6 vs. Wt",99,29168982,"MASCOT Score",38.9800000,,,,,0.017300000414252,-6.8374497
ANTQLKSDAIMDM,nt,A,2,true,"Arg/N-end rule seed, prt6 vs. Wt",99,29168982,"MASCOT Score",70.0700000,,,,,0.00029739999445155,-3.7950444
ANTQLKSDAIMD,nt,A,2,true,"Arg/N-end rule seed, prt6 vs. Wt",99,29168982,"MASCOT Score",69.7800000,,,,,5.6960001160178E-8,-1.1371709
ANTQLKSD,nt,A,2,true,"Arg/N-end rule seed, prt6 vs. Wt",99,29168982,"MASCOT Score",24.2300000,,,,,0.020780000835657,-0.6557402
ANTQLKSDAIMDMMKEH,nta,A,2,true,"Arg/N-end rule seed, prt6 vs. Wt",99,29168982,"MASCOT Score",60.3900000,,0.2603591,0.2665524,NO,4.3910000613323E-7,-4.3594696
ANTQLKSDAIMDMMKE,nta,A,2,true,"Arg/N-end rule seed, prt6 vs. Wt",99,29168982,"MASCOT Score",40.6000000,,0.0013293,0.9946776,NO,0.0013379999436438,-5.6086356
ANTQLKSDAIMDMMKE,nta,A,2,true,"Arabidopsis translation initiation landscape - NTA",167a,35069635,,,,,,,,
ANTQLKSDAIMDMM,nta,A,2,true,"Arg/N-end rule seed, prt6 vs. Wt",99,29168982,"MASCOT Score",38.9800000,,-0.2060561,0.6499840,NO,0.017300000414252,-6.8374497
ANTQLKSDAIMDM,nta,A,2,true,"Arg/N-end rule seed, prt6 vs. Wt",99,29168982,"MASCOT Score",70.0700000,,0.0486133,0.9468270,NO,0.00029739999445155,-3.7950444
ANTQLKSDAIMD,nta,A,2,true,"Arg/N-end rule seed, prt6 vs. Wt",99,29168982,"MASCOT Score",69.7800000,,0.0061490,0.9381619,NO,5.6960001160178E-8,-1.1371709
ANTQLKSDAIMD,nta,A,2,true,"HUNTER N-terminome: legumain, GluC and trypsin",119,31951383,"MaxQuant score",197.3000000,,,,,,
ANTQLKSD,nta,A,2,true,"Arg/N-end rule seed, prt6 vs. Wt",99,29168982,"MASCOT Score",24.2300000,,-0.2593433,0.0280661,NO,0.020780000835657,-0.6557402
SDAIMDMMK,mox,M,12,true,"cat2 Methionine oxidation - 3h stress",62b,25693801,"MASCOT Score",43.0000000,,0.2586109,,NO,,
SDAIMDMMK,mox,M,14,true,"cat2 Methionine oxidation - 3h stress",62b,25693801,"MASCOT Score",43.0000000,,0.2586109,,NO,,
SDAIMDMMK,mox,M,15,true,"cat2 Methionine oxidation - 3h stress",62b,25693801,"MASCOT Score",43.0000000,,0.2586109,,NO,,
IKGSLSAAQK,ph,S,105,true,"Tissue atlas Arabidopsis - ProteomicsDB",114,32188942,"MaxQuant score",116.9000000,0.9915070,,,,0.00032532500335947,
IKGSLSAAQK,ph,S,107,true,"Tissue atlas Arabidopsis - ProteomicsDB",114,32188942,"MaxQuant score",91.0930000,0.9840970,,,,0.002114380011335,
