Peptide,PTM,ModifiedAA,ModifiedPosition,PeptideUniqueToGene,ExperimentDesc,ExpID,PubmedID,ScoreType,IdentScore,LocProb,Log2FChange,PQ-val,QuantSig,PEP,MassErrorPPM
TDSEVTSLSASSPTRSPR,ph,S,7,true,"Conserved plant phosphoproteome - Arabidopsis",61a,20466843,"MASCOT Score",46.0000000,0.9032508,,,,,
TDSEVTSLSASSPTRSPR,ph,T,10,true,"atm and atr DNA damage response",88,25561503,"MASCOT Score",29.0000000,1.0000000,,,,,-0.4400000
TDSEVTSLSASSPTRSPR,ph,S,11,true,"TOR Kinase and ABA Receptor",100,29290610,XCorr,3.2112534,0.7805000,,,,2.2989999706624E-5,
TDSEVTSLSASSPTRSPR,ph,S,15,true,"Conserved plant phosphoproteome - Arabidopsis",61a,20466843,"MASCOT Score",46.0000000,1.0000000,,,,,
TDSEVTSLSASSPTR,ph,S,15,true,"Conserved plant phosphoproteome - Arabidopsis",61a,20466843,"MASCOT Score",44.0000000,1.0000000,,,,,
TDSEVTSLSASSPTR,ph,S,15,true,"Tissue atlas Arabidopsis - ProteomicsDB",114,32188942,"MaxQuant score",279.2400000,0.8678460,,,,0,
TDSEVTSLSASSPTRSPR,ph,S,16,true,"Tissue atlas Arabidopsis - ProteomicsDB",114,32188942,"MaxQuant score",279.5700000,0.8102570,,,,0,
TDSEVTSLSASSPTR,ph,S,16,true,"Conserved plant phosphoproteome - Arabidopsis",61a,20466843,"MASCOT Score",59.0000000,1.0000000,,,,,
TDSEVTSLSASSPTRSPR,ph,S,20,true,"Large-scale phosphorylation discovery",44,23111157,XCorr,4.1020000,,,,,,
TDSEVTSLSASSPTRSPR,ph,S,20,true,"SnRK2 protein kinase substrates",85,23776212,XCorr,3.2900066,0.9850000,,,,0.0095013696700335,
TDSEVTSLSASSPTRSPR,ph,S,20,true,"atm and atr DNA damage response",88,25561503,"MASCOT Score",48.0000000,1.0000000,,,,,-0.8200000
TDSEVTSLSASSPTRSPR,ph,S,20,true,"TOR Kinase and ABA Receptor",100,29290610,XCorr,3.7886329,0.9707000,,,,0.0030879999976605,
TDSEVTSLSASSPTRSPR,ph,S,20,true,"Tissue atlas Arabidopsis - ProteomicsDB",114,32188942,"MaxQuant score",251.3800000,0.9992400,,,,0,
RPAYFVQSPSR,ph,S,30,true,"atm and atr DNA damage response",88,25561503,"MASCOT Score",45.0000000,0.9580000,,,,,-0.4700000
RPAYFVQSPSR,ph,S,30,true,"TOR Kinase and ABA Receptor",100,29290610,XCorr,2.9501655,0.9983000,,,,0.00078439997741953,
RPAYFVQSPSR,ph,S,30,true,"Tissue atlas Arabidopsis - ProteomicsDB",114,32188942,"MaxQuant score",151.6600000,0.9994310,,,,8.4448403825377E-9,
RPAYFVQSPSRDSHDGEK,ph,S,35,true,"TOR Kinase and ABA Receptor",100,29290610,XCorr,2.7904360,0.9995000,,,,0.0072380001656711,
TATSFHSTPVLTSPMGSPPHSHSSSSR,ph,S,53,true,"Tissue atlas Arabidopsis - ProteomicsDB",114,32188942,"MaxQuant score",105.4700000,0.9180570,,,,3.2621900066591E-22,
TATSFHSTPVLTSPMGSPPHSHSSSSR,ph,S,57,true,"Tissue atlas Arabidopsis - ProteomicsDB",114,32188942,"MaxQuant score",157.9600000,0.9987870,,,,0,
VQAGQDAGGIGTDMITMNATLR,ng,N,168,true,"Conserved N-glycosylation",74,22633491,"MaxQuant Score",204.9000000,1.0000000,,,,0,-0.8970000
LNFTVR,ng,N,272,true,"Conserved N-glycosylation",74,22633491,"MaxQuant Score",109.1300000,1.0000000,,,,0.052000001072884,-0.1800000
HIPITNNCTVTSI,ng,N,314,true,"Conserved N-glycosylation",74,22633491,"MaxQuant Score",145.8600000,0.8820000,,,,3.0220000010336E-20,0.4510000
