Peptide,PTM,ModifiedAA,ModifiedPosition,PeptideUniqueToGene,ExperimentDesc,ExpID,PubmedID,ScoreType,IdentScore,LocProb,Log2FChange,PQ-val,QuantSig,PEP,MassErrorPPM
MFRNQYDTD,nta,M,1,false,"Arg/N-end rule seed, prt6 vs. Wt",99,29168982,"MASCOT Score",30.0500000,,,,,0.0023380001075566,-0.9310503
NQYDTDVTTWSPTGR,ph,S,14,false,"Tissue atlas Arabidopsis - ProteomicsDB",114,32188942,"MaxQuant score",237.8900000,0.9135660,,,,0,
SHVVLACVNKAQSELSSHQR,nt,S,42,false,"Arabidopsis translation initiation landscape - NT",167b,35069635,,,,,,,,
SHVVLACVNK,so,C,48,false,"Arabidopsis S-sulfenylation chemoproteomics",108,31578252,"pFind PSM Score",0.0367155,,0.7807800,,,,1.0304394
SHVVLACVNK,so,C,48,false,"S-sulfenylation site detection using YAP1C",110,32714340,,,,,,,,
SRSHVVLACVNKAQSELSSHQR,ub,K,51,false,"Arabidopsis ubiquitination by TUBEs",2,23667124,,,,,,,,
SESINHSFTYESPLPVGR,nt,S,90,false,"Arg/N-end rule seed, prt6 vs. Wt",99,29168982,"MASCOT Score",50.6900000,,-0.0992134,0.6334130,NO,0.0027240000199527,-8.1116154
SESINHSFTYESPLPVGR,nt,S,90,false,"Arabidopsis translation initiation landscape - NT",167b,35069635,,,,,,,,
SESINHSFTYESPLPVGR,ph,S,90,false,"Lateral root-induction - NAA vs control",106,23328941,"MASCOT Score",30.0000000,,,,,,
SESINHSFTYESPLPVGR,ph,S,92,false,"Lateral root-induction - NAA vs control",106,23328941,"MASCOT Score",28.0000000,,,,,,
SESINHSFTYESPLPVGR,ph,S,92,false,"Tissue atlas Arabidopsis - ProteomicsDB",114,32188942,"MaxQuant score",240.4200000,0.9961000,,,,0,
SESINHSFTYESPLPVGR,ph,S,101,false,"Tissue atlas Arabidopsis - ProteomicsDB",114,32188942,"MaxQuant score",151.3000000,0.9999990,,,,3.8390800532984E-18,
AQVCTQR,sno,C,119,false,"hot5-4 / wildtype, FAT-switch S-nitrosoproteome",169,37277371,,,,0.1020498,0.7257480,NO,,
SQAAKTYLER,ac,K,169,false,"Quantitative Acetylproteomics",101,29440448,,,,,,,,
SQAAKTYLER,ub,K,169,false,"Arabidopsis ubiquitination COFRADIC",40,26744219,"MaxQuant Score",61.3440000,1.0000000,,,,0.0070000002160668,-0.1780000
