Peptide,PTM,ModifiedAA,ModifiedPosition,PeptideUniqueToGene,ExperimentDesc,ExpID,PubmedID,ScoreType,IdentScore,LocProb,Log2FChange,PQ-val,QuantSig,PEP,MassErrorPPM
ASGSETPDLTVATR,nt,A,33,true,"N-terminal ChaFRADIC",92,26010716,"MASCOT Score",61.4000000,,,,,2.4159999156836E-5,
ASGSETPDLTVATR,nt,A,33,true,"HUNTER N-terminome: legumain, GluC and trypsin",119,31951383,"MaxQuant score",57.0190000,,,,,,
ASGSETPDLTVATR,nta,A,33,true,"N-terminal ChaFRADIC",92,26010716,"MASCOT Score",61.4000000,,,,,2.4159999156836E-5,
ASGSETPDLTVATR,nta,A,33,true,"HUNTER N-terminome: legumain, GluC and trypsin",119,31951383,"MaxQuant score",117.9800000,,,,,,
SGSETPDLTVATRTGSKDLPIRN,nt,S,34,true,"HUNTER N-terminome: legumain, GluC and trypsin",119,31951383,"MaxQuant score",128.8800000,,,,,,
SGSETPDLTVATRTGSKD,nt,S,34,true,"HUNTER N-terminome: legumain, GluC and trypsin",119,31951383,"MaxQuant score",61.1670000,,,,,,
SGSETPDLTVATR,nt,S,34,true,"Arg/N-end rule pathway Roots",80,25728785,"MASCOT Score",74.5100000,,,,,0.00014859999646433,
SGSETPDLTVATR,nt,S,34,true,"N-terminal ChaFRADIC",92,26010716,"MASCOT Score",65.0500000,,,,,1.0600000450722E-6,
SGSETPDLTVATR,nt,S,34,true,"Stromal N-terminome",96,26371235,"MASCOT Score",92.0700000,,,,,,
SGSETPDLTVATR,nt,S,34,true,"Arg/N-end rule seed, prt6 vs. Wt",99,29168982,"MASCOT Score",57.0900000,,-0.4363998,0.0086324,NO,0.0014390000142157,-0.4417828
SGSETPDLTVATR,nt,S,34,true,"FtsH12 N-terminome: WT / FtsH12 knockdown miRNA",118,33216923,"MaxQuant score",50.7870000,,,,,0.048852000385523,
SGSETPDLTVATR,nt,S,34,true,"HUNTER N-terminome: legumain, GluC and trypsin",119,31951383,"MaxQuant score",174.4200000,,,,,,
SGSETPDLT,nt,S,34,true,"N-terminal ChaFRADIC",92,26010716,"MASCOT Score",76.7300000,,,,,3.8490001315949E-5,
SGSETPDLTVATR,nta,S,34,true,"N-terminal ChaFRADIC",92,26010716,"MASCOT Score",61.7900000,,,,,0.0003001999866683,
SGSETPDLTVATR,nta,S,34,true,"Stromal N-terminome",96,26371235,"MASCOT Score",58.7300000,,,,,,
SGSETPDLTVATR,nta,S,34,true,"HUNTER N-terminome: legumain, GluC and trypsin",119,31951383,"MaxQuant score",128.1700000,,,,,,
TGSKDLPIR,ph,S,49,true,"atm and atr DNA damage response",88,25561503,"MASCOT Score",26.0000000,0.9250000,,,,,-1.7500000
NIPGNYGLPIVGPIKDR,ac,K,70,true,"Histone deacetylases - hda14 vs WT (thylakoids)",98d,29061669,"MaxQuant Score",76.3000000,1.0000000,0.2380000,0.8892011,NO,3.3300000978898E-8,
SFPVLFDVDKVEKK,ac,K,130,true,"Quantitative Acetylproteomics",101,29440448,,,,,,,,
SFPVLFDVDKVEK,ac,K,130,true,"Histone deacetylases substrates - TSA vs control",98b,29061669,"MaxQuant Score",106.0000000,1.0000000,0.3970000,0.8413951,NO,3.2999999954875E-10,
SFPVLFDVDKVEK,ac,K,130,true,"Histone deacetylases - hda14 vs WT (thylakoids)",98d,29061669,"MaxQuant Score",98.9000000,1.0000000,0.1700000,0.8892011,NO,5.3799999477633E-7,
SFPVLFDVDKVEKK,ac,K,133,true,"Quantitative Acetylproteomics",101,29440448,,,,,,,,
ILSYLDPSEPKHEK,ac,K,163,true,"Histone deacetylases - apicidin vs control",98a,29061669,"MaxQuant Score",113.5000000,1.0000000,0.0240000,0.9141132,NO,1.7000000696044E-7,
ILSYLDPSEPKHEK,ac,K,163,true,"Histone deacetylases- hda14 vs WT (low light)",98c,29061669,"MaxQuant Score",118.1600000,1.0000000,-0.5760000,0.9885531,NO,4.0999999328051E-5,
ILSYLDPSEPKHEK,ac,K,163,true,"Histone deacetylases - hda14 vs WT (thylakoids)",98d,29061669,"MaxQuant Score",144.8000000,1.0000000,0.1300000,0.9246982,NO,3.2700001040276E-10,
ILSYLDPSEPKHEK,ac,K,163,true,"Histone deacetylases substrates - hda14 vs WT",98e,29061669,"MaxQuant Score",69.3000000,1.0000000,0.1740000,0.9099133,NO,1.1000000085915E-5,
ILSYLDPSEPKHEK,ac,K,163,true,"Quantitative Acetylproteomics",101,29440448,,,,,,,,
ELSLKGK,ac,K,204,true,"Quantitative Acetylproteomics",101,29440448,,,,,,,,
AFYGTNPADTKLK,ac,K,234,true,"Histone deacetylases - hda14 vs WT (thylakoids)",98d,29061669,"MaxQuant Score",67.0000000,1.0000000,0.3680000,0.8394600,NO,0.0010000000474975,
AFYGTNPADTKLK,ac,K,234,true,"Quantitative Acetylproteomics",101,29440448,,,,,,,,
SLPPALVK,nt,S,272,true,"N-terminal ChaFRADIC",92,26010716,"MASCOT Score",32.7400000,,,,,0.0071000000461936,
ILFPNMVKR,ac,K,335,true,"Quantitative Acetylproteomics",101,29440448,,,,,,,,
SVIKSNGGELTMGAIEK,ac,K,357,true,"Quantitative Acetylproteomics",101,29440448,,,,,,,,
MELTKSVVYECLR,ac,K,375,true,"Histone deacetylases - apicidin vs control",98a,29061669,"MaxQuant Score",89.7000000,1.0000000,-0.1190000,0.7261060,NO,0.0010000000474975,
DLVIESHDAAFKVK,ac,K,409,true,"Histone deacetylases - apicidin vs control",98a,29061669,"MaxQuant Score",130.6000000,1.0000000,-0.0030000,0.9862795,NO,1.6999999839167E-23,
DLVIESHDAAFKVK,ac,K,409,true,"Histone deacetylases - hda14 vs WT (thylakoids)",98d,29061669,"MaxQuant Score",117.2000000,1.0000000,0.0350000,0.9954054,NO,1.3100000160193E-6,
FVGEEGEKLLR,ac,K,448,true,"Histone deacetylases substrates - TSA vs control",98b,29061669,"MaxQuant Score",69.7000000,1.0000000,-0.0330000,0.9977001,NO,0.0010000000474975,
FVGEEGEKLLR,ac,K,448,true,"Histone deacetylases - hda14 vs WT (thylakoids)",98d,29061669,"MaxQuant Score",100.9000000,1.0000000,0.3180000,0.7816278,NO,0.003000000026077,
FVGEEGEKLLR,ac,K,448,true,"Histone deacetylases substrates - hda14 vs WT",98e,29061669,"MaxQuant Score",51.3000000,1.0000000,0.0140000,0.9772372,NO,0.0049999998882413,
FVGEEGEKLLR,ac,K,448,true,"Quantitative Acetylproteomics",101,29440448,,,,,,,,
SNGPETETPTVGNK,nt,S,456,true,"N-terminal ChaFRADIC",92,26010716,"MASCOT Score",47.4800000,,,,,1.703000052089E-8,
SNGPETETPTVG,nt,S,456,true,"N-terminal ChaFRADIC",92,26010716,"MASCOT Score",24.5400000,,,,,1.3330000001588E-6,
