Peptide,PTM,ModifiedAA,ModifiedPosition,PeptideUniqueToGene,ExperimentDesc,ExpID,PubmedID,ScoreType,IdentScore,LocProb,Log2FChange,PQ-val,QuantSig,PEP,MassErrorPPM
LVQLDSLDEVSDSLHSSPSR,ph,S,451,true,"Tissue atlas Arabidopsis - ProteomicsDB",114,32188942,"MaxQuant score",55.6620000,0.7936170,,,,0.00065641099354252,
LVQLDSLDEVSDSLHSSPSR,ph,S,456,true,"Tissue atlas Arabidopsis - ProteomicsDB",114,32188942,"MaxQuant score",126.6800000,0.9901730,,,,1.0048700096316E-17,
LVQLDSLDEVSDSLHSSPSRK,ph,S,458,true,"TOR Kinase and ABA Receptor",100,29290610,XCorr,3.6733286,0.9694000,,,,0.00055150000844151,
LVQLDSLDEVSDSLHSSPSR,ph,S,458,true,"SnRK2 protein kinase substrates",85,23776212,XCorr,2.8725877,0.7550000,,,,0.0014744499931112,
LVQLDSLDEVSDSLHSSPSR,ph,S,458,true,"Tissue atlas Arabidopsis - ProteomicsDB",114,32188942,"MaxQuant score",248.7900000,0.9845280,,,,0,
LVQLDSLDEVSDSLHSSPSR,ph,S,461,true,"Tissue atlas Arabidopsis - ProteomicsDB",114,32188942,"MaxQuant score",248.7900000,0.7746500,,,,0,
LVQLDSLDEVSDSLHSSPSRK,ph,S,462,true,"TOR Kinase and ABA Receptor",100,29290610,XCorr,3.6733286,0.8409000,,,,0.00055150000844151,
LVQLDSLDEVSDSLHSSPSR,ph,S,462,true,"Large-scale phosphorylation discovery",44,23111157,XCorr,6.0850000,,,,,,
LVQLDSLDEVSDSLHSSPSR,ph,S,462,true,"Phospho cell culture sucrose/TOR",109,30833711,,,0.7508540,,,,,
LVQLDSLDEVSDSLHSSPSR,ph,S,462,true,"Tissue atlas Arabidopsis - ProteomicsDB",114,32188942,"MaxQuant score",453.1700000,0.9750310,,,,0,
LVQLDSLDEVSDSLHSSPSR,ph,S,464,true,"Large-scale phosphorylation discovery",44,23111157,XCorr,5.8670000,,,,,,
KTISLVDLK,ph,S,803,true,"atm and atr DNA damage response",88,25561503,"MASCOT Score",46.0000000,1.0000000,,,,,-0.3800000
TISLVDLK,ph,S,803,true,"atm and atr DNA damage response",88,25561503,"MASCOT Score",39.0000000,1.0000000,,,,,-2.0900000
TISLVDLK,ph,S,803,true,"Tissue atlas Arabidopsis - ProteomicsDB",114,32188942,"MaxQuant score",152.6900000,0.9999900,,,,8.0505400546826E-5,
DNGIQWISPPPSQITPK,ph,S,898,true,"Tissue atlas Arabidopsis - ProteomicsDB",114,32188942,"MaxQuant score",104.6100000,0.9606950,,,,1.2849300219386E-6,
DNGIQWISPPPSQITPK,ph,T,905,true,"Tissue atlas Arabidopsis - ProteomicsDB",114,32188942,"MaxQuant score",152.3200000,0.7638590,,,,1.8508799094069E-12,
