Peptide,PTM,ModifiedAA,ModifiedPosition,PeptideUniqueToGene,ExperimentDesc,ExpID,PubmedID,ScoreType,IdentScore,LocProb,Log2FChange,PQ-val,QuantSig,PEP,MassErrorPPM
VNEPVQPPAPTITAEAQSPN,nt,V,77,true,"HUNTER N-terminome: legumain, GluC and trypsin",119,31951383,"MaxQuant score",164.1800000,,,,,,
VNEPVQPPAPTITAE,nt,V,77,true,"N-terminal ChaFRADIC",92,26010716,"MASCOT Score",74.8900000,,,,,1.9270000848337E-6,
VNEPVQPPAPTITAE,nt,V,77,true,"Arg/N-end rule seed, prt6 vs. Wt",99,29168982,"MASCOT Score",45.3500000,,0.2414382,0.0469855,NO,0.00019580000662245,-0.3657199
VNEPVQPPAPTITAE,nt,V,77,true,"HUNTER N-terminome: legumain, GluC and trypsin",119,31951383,"MaxQuant score",168.8200000,,,,,,
VNEPVQPPAPTITA,nt,V,77,true,"N-terminal ChaFRADIC",92,26010716,"MASCOT Score",44.4100000,,,,,2.2749999661897E-9,
VNEPVQPPAPTIT,nt,V,77,true,"N-terminal ChaFRADIC",92,26010716,"MASCOT Score",53.0200000,,,,,2.4969999401492E-9,
VNEPVQPPAPT,nt,V,77,true,"N-terminal ChaFRADIC",92,26010716,"MASCOT Score",64.4400000,,,,,5.0910000481963E-7,
NEPVQPPAPTITAE,nt,N,78,true,"N-terminal ChaFRADIC",92,26010716,"MASCOT Score",30.8100000,,,,,0.00022360000002664,
NEPVQPPAPTIT,nt,N,78,true,"N-terminal ChaFRADIC",92,26010716,"MASCOT Score",39.2600000,,,,,3.9189998801703E-7,
LMTAPNPQAQSSDLPDGTQWR,nt,L,105,true,"N-terminal ChaFRADIC",92,26010716,"MASCOT Score",57.2100000,,,,,4.248000007312E-10,
TAPNPQAQSSDLPDGTQWR,nt,T,107,true,"N-terminal ChaFRADIC",92,26010716,"MASCOT Score",47.7400000,,,,,5.8300000382872E-9,
SSDLPDGTQW,nt,S,115,true,"N-terminal ChaFRADIC",92,26010716,"MASCOT Score",31.0900000,,,,,0.00039209998794831,
SKFQEVPETGVTFGDVAGADQAK,ac,K,238,true,"Histone deacetylases - hda14 vs WT (thylakoids)",98d,29061669,"MaxQuant Score",48.8000000,1.0000000,0.4160000,0.8394600,NO,1.7200000002049E-5,
LELQEVVDFLKNPDK,ac,K,270,false,"Histone deacetylases - apicidin vs control",98a,29061669,"MaxQuant Score",125.4000000,1.0000000,-0.2630000,0.2944422,NO,9.999999960042E-12,
NPDKYTALGAK,ac,K,274,false,"Histone deacetylases - apicidin vs control",98a,29061669,"MaxQuant Score",57.2000000,1.0000000,0.3230000,0.1104079,NO,0.0060000000521541,
NPDKYTALGAK,ac,K,274,false,"Histone deacetylases substrates - TSA vs control",98b,29061669,"MaxQuant Score",57.2000000,1.0000000,-0.1690000,0.9977001,NO,0.0060000000521541,
NPDKYTALGAK,ac,K,274,false,"Histone deacetylases - hda14 vs WT (thylakoids)",98d,29061669,"MaxQuant Score",57.2000000,1.0000000,0.0660000,0.9931160,NO,0.014000000432134,
YTALGAKIPK,ac,K,281,false,"Quantitative Acetylproteomics",101,29440448,,,,,,,,
GCLLVGPPGTGK,sno,C,286,false,"hot5-4 / wildtype, FAT-switch S-nitrosoproteome",169,37277371,,,,-0.4001532,0.0949422,NO,,
VRDLFEKAK,ac,K,337,false,"Histone deacetylases - hda14 vs WT (thylakoids)",98d,29061669,"MaxQuant Score",97.8000000,1.0000000,-0.1510000,0.9571941,NO,0.0070000002160668,
VRDLFEKAK,ac,K,337,false,"Quantitative Acetylproteomics",101,29440448,,,,,,,,
DLFEKAK,ac,K,337,false,"Quantitative Acetylproteomics",101,29440448,,,,,,,,
APCIVFIDEIDAVGR,sno,C,344,false,"hot5-4 / wildtype, FAT-switch S-nitrosoproteome",169,37277371,,,,-0.2415005,0.3342429,NO,,
QVTVDRPDVAGR,ph,T,416,false,"atm and atr DNA damage response",88,25561503,"MASCOT Score",30.0000000,1.0000000,,,,,0.3000000
QVTVDRPDVAGR,ph,T,416,false,"Tissue atlas Arabidopsis - ProteomicsDB",114,32188942,"MaxQuant score",71.3440000,1.0000000,,,,0.0015095600392669,
VQILKVHSR,ac,K,430,true,"Histone deacetylases - hda14 vs WT (thylakoids)",98d,29061669,"MaxQuant Score",43.4000000,1.0000000,-0.2600000,0.8394600,NO,0.014000000432134,
VQILKVHSR,ac,K,430,true,"Quantitative Acetylproteomics",101,29440448,,,,,,,,
AIGKDVDYEK,ac,K,440,true,"Histone deacetylases - hda14 vs WT (thylakoids)",98d,29061669,"MaxQuant Score",92.0000000,1.0000000,1.0310000,0.6280584,NO,0.0070000002160668,
DVDYEKVAR,ac,K,446,true,"Histone deacetylases - apicidin vs control",98a,29061669,"MaxQuant Score",164.7000000,1.0000000,-0.0320000,0.8609938,NO,2.3999999238373E-19,
DVDYEKVAR,ac,K,446,true,"Histone deacetylases substrates - TSA vs control",98b,29061669,"MaxQuant Score",164.7000000,1.0000000,0.2620000,0.9794900,NO,2.3999999238373E-19,
DVDYEKVAR,ac,K,446,true,"Histone deacetylases - hda14 vs WT (thylakoids)",98d,29061669,"MaxQuant Score",88.5000000,1.0000000,-0.6130000,0.6591739,NO,0.0070000002160668,
DVDYEKVAR,ac,K,446,true,"Histone deacetylases substrates - hda14 vs WT",98e,29061669,"MaxQuant Score",118.7000000,1.0000000,-0.0420000,0.9289664,NO,1.2000000104706E-8,
DVDYEKVAR,ac,K,446,true,"Quantitative Acetylproteomics",101,29440448,,,,,,,,
MNEAAILAAR,nt,M,463,false,"Stromal N-terminome",96,26371235,"MASCOT Score",50.8200000,,,,,,
ELKEISKDEISDALER,ac,K,476,false,"Histone deacetylases - hda14 vs WT (thylakoids)",98d,29061669,"MaxQuant Score",83.4000000,1.0000000,-0.9480000,0.8394600,NO,6.690000020626E-8,
ELKEISKDEISDALER,ac,K,476,false,"Histone deacetylases substrates - hda14 vs WT",98e,29061669,"MaxQuant Score",58.2000000,0.9960000,-0.0400000,0.9354057,NO,0.00044999999227002,
EISKDEISDALER,ac,K,480,false,"Histone deacetylases - apicidin vs control",98a,29061669,"MaxQuant Score",79.6000000,1.0000000,-0.1530000,0.3917419,NO,0.00073999998858199,
EISKDEISDALER,ac,K,480,false,"Histone deacetylases - hda14 vs WT (thylakoids)",98d,29061669,"MaxQuant Score",150.1000000,1.0000000,-0.2760000,0.8892011,NO,3.7599998670146E-9,
EISKDEISDALER,ac,K,480,false,"Histone deacetylases substrates - hda14 vs WT",98e,29061669,"MaxQuant Score",153.1000000,1.0000000,-0.0340000,0.9418896,NO,1.3000000556892E-37,
NAVVSEEKK,ac,K,505,false,"Quantitative Acetylproteomics",101,29440448,,,,,,,,
KIGQVAVGGAGGNPFLGQSMSSQK,ph,S,631,true,"Tissue atlas Arabidopsis - ProteomicsDB",114,32188942,"MaxQuant score",118.7600000,0.9047810,,,,4.7734399990901E-22,
