Peptide,PTM,ModifiedAA,ModifiedPosition,PeptideUniqueToGene,ExperimentDesc,ExpID,PubmedID,ScoreType,IdentScore,LocProb,Log2FChange,PQ-val,QuantSig,PEP,MassErrorPPM
STVRKITLKSSDGE,nta,S,2,true,"Arabidopsis translation initiation landscape - NTA",167a,35069635,,,,,,,,
HMIEDDCTDNGIPLPNVTSK,so,C,38,true,"S-sulfenylation site detection using YAP1C",110,32714340,,,,,,,,
HMIEDDCTDNGIPLPNVTSKILSK,ub,K,51,true,"upl3 mutant / wildtype",168,35926874,"MaxQuant score",73.8310000,1.0000000,0.7224660,0.1620230,NO,1.0835999830761E-7,0.7386300
VIEYCK,sno,C,60,false,"hot5-4 / wildtype, FAT-switch S-nitrosoproteome",169,37277371,,,,,,,,
VIEYCKR,so,C,60,false,"S-sulfenylation site detection using YAP1C",110,32714340,,,,,,,,
VIEYCK,so,C,60,false,"Arabidopsis S-sulfenylation chemoproteomics",108,31578252,"pFind PSM Score",0.2962380,,,,,,0.7726998
VIEYCKR,ub,K,61,false,"upl3 mutant / wildtype",168,35926874,"MaxQuant score",55.4410000,1.0000000,-0.9268653,,,0.028507800772786,0.2764600
GLLDLTCQTVADMIK,so,C,129,true,"S-sulfenylation site detection using YAP1C",110,32714340,,,,,,,,
GKTPEEIR,ub,K,139,false,"upl3 mutant / wildtype",168,35926874,"MaxQuant score",80.1650000,1.0000000,0.2128806,0.6132600,NO,0.027749199420214,0.8996800
TFNIKNDFTPEEEEEVRR,ub,K,151,false,"upl3 mutant / wildtype",168,35926874,"MaxQuant score",95.2050000,1.0000000,-0.6574453,,,2.9834899351044E-7,1.4309000
NDFTPEEEEEVRR,ph,T,155,false,"srk2dei ABA signaling phopshoproteomics",83,23572148,"MASCOT Score",28.0000000,,,,,,-0.0003000
NDFTPEEEEEVRR,ph,T,155,false,"atm and atr DNA damage response",88,25561503,"MASCOT Score",61.0000000,1.0000000,,,,,0.4100000
NDFTPEEEEEVRR,ph,T,155,false,"TOR Kinase and ABA Receptor",100,29290610,XCorr,2.5875196,1.0000000,,,,0.01482000015676,
NDFTPEEEEEVRR,ph,T,155,false,"Col-0 callus - FC Col-0 vs. Col-0 Xray",111a,31410901,,33.5100000,,1.7480261,0.0139285,YES,,0.6619140
NDFTPEEEEEVRR,ph,T,155,false,"Col-0 X-ray callus - FC Col-0 vs. Col-0 Xray",111b,31410901,,33.5100000,,1.7480261,0.0139285,YES,,0.6619140
NDFTPEEEEEVRR,ph,T,155,false,"atm callus - FC atm vs. atm Xray",111c,31410901,,33.5100000,,1.0633467,0.1164971,NO,,0.6619140
NDFTPEEEEEVRR,ph,T,155,false,"atm-3 X-ray callus - FC atm vs. atm Xray",111d,31410901,,33.5100000,,1.0633467,0.1164971,NO,,0.6619140
NDFTPEEEEEVRR,ph,T,155,false,"Tissue atlas Arabidopsis - ProteomicsDB",114,32188942,"MaxQuant score",185.6700000,1.0000000,,,,1.0080500098134E-22,
