Peptide,PTM,ModifiedAA,ModifiedPosition,PeptideUniqueToGene,ExperimentDesc,ExpID,PubmedID,ScoreType,IdentScore,LocProb,Log2FChange,PQ-val,QuantSig,PEP,MassErrorPPM
MENLISLVNKIQR,nta,M,1,true,"Arg/N-end rule pathway Roots",80,25728785,"MASCOT Score",65.1100000,,,,,8.7540001914022E-6,
MENLISLVNKIQR,nta,M,1,true,"N-terminal ChaFRADIC",92,26010716,"MASCOT Score",41.3100000,,,,,0.00027950000367127,
MENLISLVNKIQR,nta,M,1,true,"Stromal N-terminome",96,26371235,"MASCOT Score",69.9300000,,,,,,
MENLISLVNKIQR,nta,M,1,true,"HUNTER N-terminome: legumain, GluC and trypsin",119,31951383,"MaxQuant score",50.6750000,,,,,,
MENLISLVNKIQR,nta,M,1,true,"Arabidopsis translation initiation landscape - NTA",167a,35069635,,,,,,,,
MENLISLVNK,nta,M,1,true,"N-term acetylation drought responses",5,26184543,,,,,,,,
MENLISLVNK,nta,M,1,true,"Characterization plant N-terminal acetylation",6,22223895,"MASCOT Score",81.0100000,,,,,,
MENLISLVN,nta,M,1,true,"Arg/N-end rule seed, prt6 vs. Wt",99,29168982,"MASCOT Score",37.6500000,,,,,0.19789999723434,0.5196667
SSVLESIVGK,ph,S,49,true,"atm and atr DNA damage response",88,25561503,"MASCOT Score",60.0000000,0.9970000,,,,,-0.6700000
MLSKHLER,ac,K,289,true,"Quantitative Acetylproteomics",101,29440448,,,,,,,,
VYNVFDNQLPAALKR,ac,K,373,true,"Quantitative Acetylproteomics",101,29440448,,,,,,,,
LQFDKQLAMDNIR,ub,K,379,true,"upl3 mutant / wildtype",168,35926874,"MaxQuant score",76.7280000,1.0000000,-0.0985055,0.8355800,NO,0.00011494500358822,0.4900100
VEVTNAAIESLDK,ph,T,458,true,"Phosphorylation Early Elicitor Signaling",23,17317660,,,,,,,,
VEVTNAAIESLDK,ph,S,464,true,"Phosphorylation Early Elicitor Signaling",23,17317660,,,,,,,,
VEVTNAAIESLDKMR,ub,K,467,true,"upl3 mutant / wildtype",168,35926874,"MaxQuant score",166.9000000,1.0000000,0.9876847,0.3829200,NO,1.318719968814E-21,0.2262800
SIVYCQVR,acy,C,547,false,"Arabidopsis S-acylation atlas - Silique",163e,35681017,,,,,,,,
