Peptide,PTM,ModifiedAA,ModifiedPosition,PeptideUniqueToGene,ExperimentDesc,ExpID,PubmedID,ScoreType,IdentScore,LocProb,Log2FChange,PQ-val,QuantSig,PEP,MassErrorPPM
SSSPSSVVETDNDDDNDLTFSGCR,nt,S,49,true,"Arg/N-end rule seed, prt6 vs. Wt",99,29168982,"MASCOT Score",70.5400000,,-1.2923163,0.0989083,NO,0.00023419999342877,-1.5173421
SSSPSSVVETDNDDDNDLTFSGCR,nt,S,49,true,"HUNTER N-terminome: legumain, GluC and trypsin",119,31951383,"MaxQuant score",57.8020000,,,,,,
SSPSSVVETDNDDDNDLTFSGCR,nt,S,50,true,"Arg/N-end rule seed, prt6 vs. Wt",99,29168982,"MASCOT Score",59.1100000,,0.0554735,0.9353261,NO,0.011749999597669,-1.3751975
SSPSSVVETDNDDDNDLTFSGCR,nt,S,50,true,"HUNTER N-terminome: legumain, GluC and trypsin",119,31951383,"MaxQuant score",126.4500000,,,,,,
SSPSSVVETDNDDDNDLTFSGCR,nta,S,50,true,"HUNTER N-terminome: legumain, GluC and trypsin",119,31951383,"MaxQuant score",48.5000000,,,,,,
PAFVEAGGR,nt,P,111,true,"Arg/N-end rule seed, prt6 vs. Wt",99,29168982,"MASCOT Score",25.1800000,,-0.5138056,0.0308537,NO,0.16820000112057,-0.6555864
GDSKSSTSVDTSDSLLR,ac,K,138,true,"Quantitative Acetylproteomics",101,29440448,,,,,,,,
GDSKSSTSVDTSDSLLR,ub,K,138,true,"Arabidopsis ubiquitination COFRADIC",40,26744219,"MaxQuant Score",105.9000000,1.0000000,,,,4.7380000758242E-22,-0.0830000
SSTSVDTSDSLLR,ph,T,145,true,"Tissue atlas Arabidopsis - ProteomicsDB",114,32188942,"MaxQuant score",75.7640000,0.8143940,,,,0.0039632897824049,
QTKPTSSSKSSNK,ub,K,154,true,"Arabidopsis ubiquitination COFRADIC",40,26744219,"MaxQuant Score",104.4100000,1.0000000,,,,2.399000038622E-7,0.2390000
QTKPTSSSKSSNK,ub,K,160,true,"Arabidopsis ubiquitination COFRADIC",40,26744219,"MaxQuant Score",104.4100000,1.0000000,,,,2.399000038622E-7,0.2390000
QTKPTSSSKSSNK,ub,K,164,true,"Arabidopsis ubiquitination COFRADIC",40,26744219,"MaxQuant Score",104.4100000,1.0000000,,,,2.399000038622E-7,0.2390000
