Peptide,PTM,ModifiedAA,ModifiedPosition,PeptideUniqueToGene,ExperimentDesc,ExpID,PubmedID,ScoreType,IdentScore,LocProb,Log2FChange,PQ-val,QuantSig,PEP,MassErrorPPM
MESTISLKVNKGKGKGSKGASSSD,nta,M,1,true,"Arabidopsis translation initiation landscape - NTA",167a,35069635,,,,,,,,
MESTISLKVN,nta,M,1,true,"Arg/N-end rule seed, prt6 vs. Wt",99,29168982,"MASCOT Score",32.5500000,,0.1098117,0.6121075,NO,0.051089998334646,-3.2218028
MESTISLKVN,nta,M,1,true,"HUNTER N-terminome: legumain, GluC and trypsin",119,31951383,"MaxQuant score",66.6920000,,,,,,
MESTISLK,nta,M,1,true,"Characterization plant N-terminal acetylation",6,22223895,"MASCOT Score",46.9400000,,,,,,
MESTISLKVNK,ph,T,4,true,"Tissue atlas Arabidopsis - ProteomicsDB",114,32188942,"MaxQuant score",108.6800000,0.8799570,,,,1.4141899555398E-5,
MESTISLK,ph,T,4,true,"atm and atr DNA damage response",88,25561503,"MASCOT Score",42.0000000,0.9980000,,,,,-0.2200000
MESTISLKVNK,ph,S,6,true,"Protein sumoylation and phosphorylation cross-talk",97,28419593,,,,,,,,
MESTISLKVNK,ph,S,6,true,"Tissue atlas Arabidopsis - ProteomicsDB",114,32188942,"MaxQuant score",178.8400000,0.9999430,,,,1.1522100243041E-14,
MESTISLK,ph,S,6,true,"atm and atr DNA damage response",88,25561503,"MASCOT Score",42.0000000,0.9580000,,,,,-0.4600000
MESTISLK,ph,S,6,true,"TOR Kinase and ABA Receptor",100,29290610,XCorr,2.9308364,0.9999000,,,,0.00044860001071356,
MESTISLK,ph,S,6,true,"Phospho cell culture sucrose/TOR",109,30833711,,,0.9918350,,,,,
GASSSDDKSKFDVVK,ph,S,21,true,"Tissue atlas Arabidopsis - ProteomicsDB",114,32188942,"MaxQuant score",52.1850000,0.7611270,,,,0.0019580100197345,
