Peptide,PTM,ModifiedAA,ModifiedPosition,PeptideUniqueToGene,ExperimentDesc,ExpID,PubmedID,ScoreType,IdentScore,LocProb,Log2FChange,PQ-val,QuantSig,PEP,MassErrorPPM
VEDHKHEESILEK,ph,S,10,true,"Tissue atlas Arabidopsis - ProteomicsDB",114,32188942,"MaxQuant score",78.4410000,1.0000000,,,,0.0002978979900945,
IHGHGDSSSLSDSDDDKK,ph,S,25,true,"Col-0 callus - FC Col-0 vs. Col-0 Xray",111a,31410901,,41.2300000,,4.5078519,0.0000000,NO,,0.3422137
IHGHGDSSSLSDSDDDKK,ph,S,25,true,"Col-0 X-ray callus - FC Col-0 vs. Col-0 Xray",111b,31410901,,41.2300000,,4.5078519,0.0000000,NO,,0.3422137
IHGHGDSSSLSDSDDDKK,ph,S,25,true,"atm callus - FC atm vs. atm Xray",111c,31410901,,41.2300000,,-10.8301525,0.0000000,NO,,0.3422137
IHGHGDSSSLSDSDDDKK,ph,S,25,true,"atm-3 X-ray callus - FC atm vs. atm Xray",111d,31410901,,41.2300000,,-10.8301525,0.0000000,NO,,0.3422137
IHGHGDSSSLSDSDDDKK,ph,S,26,true,"Tyrosine phosphorylation in Arabidopsis",59,18463617,"MASCOT Score",25.0000000,,,,,,-0.9601834
IHGHGDSSSLSDSDDDKK,ph,S,26,true,"Conserved plant phosphoproteome - Arabidopsis",61a,20466843,"MASCOT Score",25.0000000,1.0000000,,,,,
IHGHGDSSSLSDSDDDKK,ph,S,26,true,"Tissue atlas Arabidopsis - ProteomicsDB",114,32188942,"MaxQuant score",112.8100000,0.8441190,,,,3.5040600275272E-31,
IHGHGDSSSLSDSDDDKK,ph,S,27,true,"Col-0 callus - FC Col-0 vs. Col-0 Xray",111a,31410901,,32.7300000,,-3.5354710,0.0000000,NO,,-0.0142859
IHGHGDSSSLSDSDDDKK,ph,S,27,true,"Col-0 X-ray callus - FC Col-0 vs. Col-0 Xray",111b,31410901,,32.7300000,,-3.5354710,0.0000000,NO,,-0.0142859
IHGHGDSSSLSDSDDDKK,ph,S,27,true,"atm callus - FC atm vs. atm Xray",111c,31410901,,32.7300000,,-1.4965989,0.0000000,NO,,-0.0142859
IHGHGDSSSLSDSDDDKK,ph,S,27,true,"atm-3 X-ray callus - FC atm vs. atm Xray",111d,31410901,,32.7300000,,-1.4965989,0.0000000,NO,,-0.0142859
IHGHGDSSSLSDSDDDKK,ph,S,29,true,"Tyrosine phosphorylation in Arabidopsis",59,18463617,"MASCOT Score",22.0000000,,,,,,-1.1623276
IHGHGDSSSLSDSDDDKK,ph,S,29,true,"LAXIC - mannitol vs control",84b,23660473,XCorr,3.1800000,0.9700000,,,,0.00056360499002039,
IHGHGDSSSLSDSDDDKK,ph,S,29,true,"SnRK2 protein kinase substrates",85,23776212,XCorr,3.3630486,0.9190000,,,,0.001065899967216,
IHGHGDSSSLSDSDDDKK,ph,S,29,true,"TOR Kinase and ABA Receptor",100,29290610,XCorr,4.0207715,0.9996000,,,,0.00048839999362826,
IHGHGDSSSLSDSDDDKK,ph,S,29,true,"Phospho cell culture sucrose/TOR",109,30833711,,,1.0000000,,,,,
IHGHGDSSSLSDSDDDKK,ph,S,29,true,"Col-0 callus - FC Col-0 vs. Col-0 Xray",111a,31410901,,47.2300000,,-1.4134549,0.0000000,NO,,-0.1105935
IHGHGDSSSLSDSDDDKK,ph,S,29,true,"Col-0 X-ray callus - FC Col-0 vs. Col-0 Xray",111b,31410901,,47.2300000,,-1.4134549,0.0000000,NO,,-0.1105935
IHGHGDSSSLSDSDDDKK,ph,S,29,true,"atm callus - FC atm vs. atm Xray",111c,31410901,,47.2300000,,-4.5119161,0.0000000,NO,,-0.1105935
IHGHGDSSSLSDSDDDKK,ph,S,29,true,"atm-3 X-ray callus - FC atm vs. atm Xray",111d,31410901,,47.2300000,,-4.5119161,0.0000000,NO,,-0.1105935
IHGHGDSSSLSDSDDDKK,ph,S,29,true,"Tissue atlas Arabidopsis - ProteomicsDB",114,32188942,"MaxQuant score",254.7300000,0.9999840,,,,0,
IHGHGDSSSLSDSDDDK,ph,S,29,true,"TOR Kinase and ABA Receptor",100,29290610,XCorr,5.7662654,0.9306000,,,,4.0250000554742E-10,
IHGHGDSSSLSDSDDDKK,ph,S,31,true,"Plasmamembrane phosphorylation",20,15308754,,,,,,,,
IHGHGDSSSLSDSDDDKK,ph,S,31,true,"Phytohormone-responsive phosphoproteins",34,20374526,"MASCOT Score",57.0000000,,,,,,
IHGHGDSSSLSDSDDDKK,ph,S,31,true,"Tyrosine phosphorylation in Arabidopsis",59,18463617,"MASCOT Score",20.0000000,,,,,,-0.9601834
IHGHGDSSSLSDSDDDKK,ph,S,31,true,"LAXIC - mannitol vs control",84b,23660473,XCorr,3.1800000,0.9930000,,,,0.00056360499002039,
IHGHGDSSSLSDSDDDKK,ph,S,31,true,"TOR Kinase and ABA Receptor",100,29290610,XCorr,4.0207715,1.0000000,,,,0.00048839999362826,
IHGHGDSSSLSDSDDDKK,ph,S,31,true,"Col-0 callus - FC Col-0 vs. Col-0 Xray",111a,31410901,,44.0500000,,0.7908358,0.0000000,NO,,0.6785593
IHGHGDSSSLSDSDDDKK,ph,S,31,true,"Col-0 X-ray callus - FC Col-0 vs. Col-0 Xray",111b,31410901,,44.0500000,,0.7908358,0.0000000,NO,,0.6785593
IHGHGDSSSLSDSDDDKK,ph,S,31,true,"atm callus - FC atm vs. atm Xray",111c,31410901,,44.0500000,,2.6420599,0.0000000,NO,,0.6785593
IHGHGDSSSLSDSDDDKK,ph,S,31,true,"atm-3 X-ray callus - FC atm vs. atm Xray",111d,31410901,,44.0500000,,2.6420599,0.0000000,NO,,0.6785593
IHGHGDSSSLSDSDDDKK,ph,S,31,true,"Tissue atlas Arabidopsis - ProteomicsDB",114,32188942,"MaxQuant score",254.7300000,1.0000000,,,,0,
IHGHGDSSSLSDSDDDK,ph,S,31,true,"TOR Kinase and ABA Receptor",100,29290610,XCorr,5.0662041,1.0000000,,,,4.2830001234506E-7,
STSSSSSSFKSK,ac,K,46,true,"Quantitative Acetylproteomics",101,29440448,,,,,,,,
KVISKIPR,ph,S,245,true,"Chloroplast kinase substrates",60,19376835,"MASCOT Score",30.5700000,,,,,,-1.3511900
VISKIPR,ph,S,245,true,"Chloroplast kinase substrates",60,19376835,"MASCOT Score",30.3600000,,,,,,-0.5186100
KVISKIPR,ac,K,246,true,"Quantitative Acetylproteomics",101,29440448,,,,,,,,
