Peptide,PTM,ModifiedAA,ModifiedPosition,PeptideUniqueToGene,ExperimentDesc,ExpID,PubmedID,ScoreType,IdentScore,LocProb,Log2FChange,PQ-val,QuantSig,PEP,MassErrorPPM
MMKLKVYADR,nta,M,1,true,"N-term acetylation drought responses",5,26184543,,,,,,,,
MMKLKVYADR,nta,M,1,true,"Arabidopsis translation initiation landscape - NTA",167a,35069635,,,,,,,,
MKLKVYADRM,nt,M,2,true,"N-term acetylation drought responses",5,26184543,,,,,,,,
MKLKVYADR,nt,M,2,true,"Arabidopsis translation initiation landscape - NT",167b,35069635,,,,,,,,
AVIIFCK,so,C,22,true,"Arabidopsis S-sulfenylation chemoproteomics",108,31578252,"pFind PSM Score",0.3029650,,1.5625000,,,,-0.5637200
QQLSPEFK,ph,S,43,false,"atm and atr DNA damage response",88,25561503,"MASCOT Score",38.0000000,1.0000000,,,,,-1.4300000
KVEQWIENTKK,ub,K,206,true,"upl3 mutant / wildtype",168,35926874,"MaxQuant score",53.4480000,1.0000000,-1.0499049,,,0.010630699805915,0.2543900
VKEGFQKR,ac,K,229,true,"Quantitative Acetylproteomics",101,29440448,,,,,,,,
