Peptide,PTM,ModifiedAA,ModifiedPosition,PeptideUniqueToGene,ExperimentDesc,ExpID,PubmedID,ScoreType,IdentScore,LocProb,Log2FChange,PQ-val,QuantSig,PEP,MassErrorPPM
SIFLSPSTKK,ph,S,43,true,"Tissue atlas Arabidopsis - ProteomicsDB",114,32188942,"MaxQuant score",128.8500000,0.8170910,,,,3.606420068536E-5,
ISESPVKENLAPVATPK,ph,S,50,true,"Tissue atlas Arabidopsis - ProteomicsDB",114,32188942,"MaxQuant score",175.7700000,0.9999230,,,,1.8515799855082E-22,
SRWSFSSSK,ph,S,78,false,"atm and atr DNA damage response",88,25561503,"MASCOT Score",37.0000000,0.9210000,,,,,-1.7300000
SRWSFSSSK,ph,S,78,false,"Tissue atlas Arabidopsis - ProteomicsDB",114,32188942,"MaxQuant score",145.9100000,0.9993210,,,,0.00022170699958224,
IHSPLFEGEKPR,ph,S,137,true,"Tissue atlas Arabidopsis - ProteomicsDB",114,32188942,"MaxQuant score",144.2900000,1.0000000,,,,3.706460063313E-7,
VSFSHSPAPR,ph,S,148,true,"Tissue atlas Arabidopsis - ProteomicsDB",114,32188942,"MaxQuant score",58.8290000,0.9754970,,,,0.0073406700976193,
VSFSHSPAPR,ph,S,152,true,"Tissue atlas Arabidopsis - ProteomicsDB",114,32188942,"MaxQuant score",119.4300000,0.9927770,,,,0.00018165999790654,
LGELFRDSIREER,ph,S,167,false,"Tissue atlas Arabidopsis - ProteomicsDB",114,32188942,"MaxQuant score",152.3700000,1.0000000,,,,8.8701902711819E-8,
