Peptide,PTM,ModifiedAA,ModifiedPosition,PeptideUniqueToGene,ExperimentDesc,ExpID,PubmedID,ScoreType,IdentScore,LocProb,Log2FChange,PQ-val,QuantSig,PEP,MassErrorPPM
VVQAIISELESQGALPR,ph,S,98,true,"srk2dei ABA signaling phopshoproteomics",83,23572148,"MASCOT Score",27.0000000,,,,,,-0.0021000
VVQAIISELESQGALPR,ph,S,102,true,"srk2dei ABA signaling phopshoproteomics",83,23572148,"MASCOT Score",27.0000000,,,,,,-0.0021000
AELLSAHSDDSASLADDK,ph,S,316,true,"Tissue atlas Arabidopsis - ProteomicsDB",114,32188942,"MaxQuant score",70.8020000,0.8724500,,,,0.00045132299419492,
SNGQASSLLQSQGSGR,ph,S,478,true,"Conserved plant phosphoproteome - Arabidopsis",61a,20466843,"MASCOT Score",33.0000000,1.0000000,,,,,
SNGQASSLLQSQGSGR,ph,S,486,true,"atm and atr DNA damage response",88,25561503,"MASCOT Score",77.0000000,1.0000000,,,,,-0.5400000
SNGQASSLLQSQGSGR,ph,S,486,true,"Tissue atlas Arabidopsis - ProteomicsDB",114,32188942,"MaxQuant score",388.8300000,0.9999970,,,,0,
VSASPTLK,ph,S,515,true,"Tissue atlas Arabidopsis - ProteomicsDB",114,32188942,"MaxQuant score",112.7100000,0.9972140,,,,0.0034851799719036,
YSDIPDTYDDLDSFK,ph,S,674,true,"TOR Kinase and ABA Receptor",100,29290610,XCorr,3.6516831,0.9949000,,,,5.5469998187618E-5,
YSDIPDTYDDLDSFK,ph,S,674,true,"Tissue atlas Arabidopsis - ProteomicsDB",114,32188942,"MaxQuant score",98.5730000,0.9997200,,,,2.5761199140106E-5,
