Peptide,PTM,ModifiedAA,ModifiedPosition,PeptideUniqueToGene,ExperimentDesc,ExpID,PubmedID,ScoreType,IdentScore,LocProb,Log2FChange,PQ-val,QuantSig,PEP,MassErrorPPM
MDPYGTETVIEDE,nta,M,1,true,"Arabidopsis translation initiation landscape - NTA",167a,35069635,,,,,,,,
MDPYGTETVIEDEIHDPKPSEDIEDDDDK,ph,S,20,true,"TOR Kinase and ABA Receptor",100,29290610,XCorr,4.6665950,1.0000000,,,,5.6980002227647E-6,
MDPYGTETVIEDEIHDPKPSEDIEDDDDK,ph,S,20,true,"Tissue atlas Arabidopsis - ProteomicsDB",114,32188942,"MaxQuant score",122.4800000,0.9999930,,,,9.6409334345547E-43,
ETTSAEFLK,ph,S,55,true,"atm and atr DNA damage response",88,25561503,"MASCOT Score",44.0000000,0.9960000,,,,,0.3500000
ETTSAEFLK,ph,S,55,true,"Tissue atlas Arabidopsis - ProteomicsDB",114,32188942,"MaxQuant score",123.7900000,0.9837390,,,,0.00022846899810247,
GFGFVTYADSSVVDK,og,T,89,true,"O-GlcNac Inflorescence Tissue",81,28154133,"MASCOT Score",22.7000000,,,,,,6.8000000
GSMSSNDFK,ph,S,123,true,"atm and atr DNA damage response",88,25561503,"MASCOT Score",32.0000000,0.9850000,,,,,-1.9100000
IELSGTQVEIK,ph,S,197,true,"Lateral root-induction - NAA vs control",106,23328941,"MASCOT Score",27.0000000,,,,,,
KPNSVTTPSK,ph,T,216,true,"Large-scale phosphorylation discovery",44,23111157,XCorr,3.0500000,,,,,,
KPNSVTTPSK,ph,T,216,true,"TOR Kinase and ABA Receptor",100,29290610,XCorr,3.6231778,0.8386000,,,,0.00041499998769723,
SNFGGGYGDGYGGGHGGGYGGPGGPYK,ph,S,226,true,"Tissue atlas Arabidopsis - ProteomicsDB",114,32188942,"MaxQuant score",119.5000000,1.0000000,,,,1.0232999748145E-34,
