Peptide,PTM,ModifiedAA,ModifiedPosition,PeptideUniqueToGene,ExperimentDesc,ExpID,PubmedID,ScoreType,IdentScore,LocProb,Log2FChange,PQ-val,QuantSig,PEP,MassErrorPPM
QLVSGPHITD,nt,Q,23,true,"HUNTER N-terminome: legumain, GluC and trypsin",119,31951383,"MaxQuant score",42.8690000,,,,,,
LQGSDGCFK,ox,C,55,true,"OxiTRAQ Arabidopsis - 5 mM H2O2 versus control",47,24376095,,,,-0.2148611,0.0823221,NO,,
LQGSDGCFK,sno,C,55,true,"hot5-4 / wildtype, FAT-switch S-nitrosoproteome",169,37277371,,,,,,,,
VFIDNFSR,ng,N,117,true,"Conserved N-glycosylation",74,22633491,"MaxQuant Score",55.7770000,1.0000000,,,,0.097999997437,-0.6140000
WSVLNSSVAQVDSLIGLTK,ng,N,289,true,"Conserved N-glycosylation",74,22633491,"MaxQuant Score",161.5300000,1.0000000,,,,2.5719432014218E-41,-0.9450000
WSVLNSSVAQVDSLIGLTK,ng,N,289,true,"ER-associatied N-glycan degradation chilling stres",133,27558752,,,,,,,,
CDAFNSLIK,ox,C,589,true,"OxiTRAQ Arabidopsis - 5 mM H2O2 versus control",47,24376095,,,,-0.1495457,0.1106162,NO,,
CDAFNSLIK,sno,C,589,true,"hot5-4 / wildtype, FAT-switch S-nitrosoproteome",169,37277371,,,,,,,,
TGSESFVIVNATSEMMMLDELR,ng,N,609,true,"Conserved N-glycosylation",74,22633491,"MaxQuant Score",216.1500000,1.0000000,,,,0,1.7760000
SMDSSPPCSR,ox,C,629,true,"OxiTRAQ Arabidopsis - 5 mM H2O2 versus control",47,24376095,,,,-0.1920738,0.1904148,NO,,
VAAVGISEFGEAFSNSSTLSLR,ng,N,863,true,"Conserved N-glycosylation",74,22633491,"MaxQuant Score",107.8000000,1.0000000,,,,5.4209998268107E-8,1.4410000
FLALRNESGLCTVR,ng,N,903,true,"Conserved N-glycosylation",74,22633491,"MaxQuant Score",152.5700000,1.0000000,,,,1.6309999660516E-26,-0.5030000
VLIFIASSINVEENAGFVNVVQGR,ph,S,1280,true,"Phosphorylation in N starvation",63,22060019,"MASCOT Score",24.0000000,,,,,,3.8819100
VLIFIASSINVEENAGFVNVVQGR,ph,S,1281,true,"Phosphorylation in N starvation",63,22060019,"MASCOT Score",24.0000000,,,,,,3.8819100
TTDSNNVACIQAK,ox,C,1413,true,"OxiTRAQ Arabidopsis - 5 mM H2O2 versus control",47,24376095,,,,-0.1987337,0.1157189,NO,,
QVPTGATGTATYSGNAAQGTPERR,ph,T,1874,true,"atm and atr DNA damage response",88,25561503,"MASCOT Score",56.0000000,1.0000000,,,,,-0.2500000
QVPTGATGTATYSGNAAQGTPER,ph,T,1874,true,"Tissue atlas Arabidopsis - ProteomicsDB",114,32188942,"MaxQuant score",184.1900000,0.9999980,,,,0,
SGTVIYHEESPR,ph,S,1888,true,"atm and atr DNA damage response",88,25561503,"MASCOT Score",60.0000000,1.0000000,,,,,-0.2600000
SGTVIYHEESPR,ph,S,1888,true,"Phospho cell culture sucrose/TOR",109,30833711,,,0.9989170,,,,,
SGTVIYHEESPR,ph,S,1888,true,"Tissue atlas Arabidopsis - ProteomicsDB",114,32188942,"MaxQuant score",268.7700000,1.0000000,,,,0,
SGTVIYHEESPRTPSPFMEYVK,ph,T,1891,true,"Tissue atlas Arabidopsis - ProteomicsDB",114,32188942,"MaxQuant score",132.5300000,0.9869540,,,,2.972799980538E-28,
TPSPFMEYVK,ph,S,1893,true,"Tissue atlas Arabidopsis - ProteomicsDB",114,32188942,"MaxQuant score",105.6000000,0.9999350,,,,9.0496596385492E-6,
TVDETPYYR,ph,T,1906,true,"Tissue atlas Arabidopsis - ProteomicsDB",114,32188942,"MaxQuant score",176.4800000,1.0000000,,,,3.4759399568429E-5,
