Peptide,PTM,ModifiedAA,ModifiedPosition,PeptideUniqueToGene,ExperimentDesc,ExpID,PubmedID,ScoreType,IdentScore,LocProb,Log2FChange,PQ-val,QuantSig,PEP,MassErrorPPM
METGVVTIQEPVSTK,nta,M,1,true,"Characterization plant N-terminal acetylation",6,22223895,"MASCOT Score",95.4100000,,,,,,
TVLDDEITSGADR,nt,T,41,true,"Arg/N-end rule seed, prt6 vs. Wt",99,29168982,"MASCOT Score",50.4500000,,-0.8588687,0.1034759,NO,0.023250000551343,-0.1687188
VCEEIPIKTDEVREETDSR,ox,C,176,true,"SPEAR - 50 mM H2O2 / mock",138b,34619326,,,,3.0932099,0.0117883,YES,,
VCEEIPIK,sno,C,176,true,"hot5-4 / wildtype, FAT-switch S-nitrosoproteome",169,37277371,,,,,,,,
EDNHQEEYAESVEATK,ph,S,288,true,"TOR Kinase and ABA Receptor",100,29290610,XCorr,3.2732399,1.0000000,,,,4.6100001782179E-5,
EDNHQEEYAESVEATK,ph,S,288,true,"Tissue atlas Arabidopsis - ProteomicsDB",114,32188942,"MaxQuant score",143.3900000,0.9994230,,,,8.7532797676815E-10,
ASLDHEEEMDKITK,ph,S,344,true,"Tissue atlas Arabidopsis - ProteomicsDB",114,32188942,"MaxQuant score",97.7130000,1.0000000,,,,3.9565398765262E-5,
ASLDHEEEMDK,mox,M,351,true,"cat2 Methionine oxidation - 3h stress",62b,25693801,"MASCOT Score",46.0000000,,-0.0525543,,NO,,
TNINESEAHSAIGGEEDGQETK,ph,S,402,true,"Tissue atlas Arabidopsis - ProteomicsDB",114,32188942,"MaxQuant score",73.7530000,0.7516730,,,,9.399410032529E-7,
TNINESEAHSAIGGEEDGQETK,ph,S,406,true,"TOR Kinase and ABA Receptor",100,29290610,XCorr,5.1593065,0.9947000,,,,6.3849997786747E-6,
TNINESEAHSAIGGEEDGQETK,ph,S,406,true,"Tissue atlas Arabidopsis - ProteomicsDB",114,32188942,"MaxQuant score",175.4300000,0.9945000,,,,1.4012984643248E-45,
SSDVQAEVFGEHTEPCSSEIKDDR,sno,C,465,true,"Site-specific nitrosomeproteomic id - gsnor1-3",90b,25699590,XCorr,2.7000000,,,,,0.11729999631643,-5.0800000
AKETGPEIETAVDGESVHEIETTER,ph,S,499,true,"PAMP-triggered phosphorylation",48,24601666,"MASCOT Score",81.6600000,,,,,,
AKETGPEIETAVDGESVHEIETTER,ph,S,499,true,"LAXIC - ABA stress",84a,23660473,XCorr,4.6900000,0.9470000,,,,0.041755300015211,
AKETGPEIETAVDGESVHEIETTER,ph,S,499,true,"SnRK2 protein kinase substrates",85,23776212,XCorr,6.1661582,1.0000000,,,,1.4387400142368E-6,
AKETGPEIETAVDGESVHEIETTER,ph,S,499,true,"Tissue atlas Arabidopsis - ProteomicsDB",114,32188942,"MaxQuant score",245.0700000,0.9999700,,,,0,
ETGPEIETAVDGESVHEIETTER,ph,S,499,true,"srk2dei ABA signaling phopshoproteomics",83,23572148,"MASCOT Score",74.0000000,,,,,,0.0027000
ETGPEIETAVDGESVHEIETTER,ph,S,499,true,"SnRK2 protein kinase substrates",85,23776212,XCorr,3.3409319,0.9780000,,,,2.5896400757119E-7,
ETGPEIETAVDGESVHEIETTER,ph,S,499,true,"TOR Kinase and ABA Receptor",100,29290610,XCorr,4.3988104,0.9997000,,,,0.00070390000473708,
EEVDHISNETEEHEHVLER,ph,S,625,true,"atm and atr DNA damage response",88,25561503,"MASCOT Score",52.0000000,1.0000000,,,,,-0.6700000
EEVDHISNETEEHEHVLER,ph,S,625,true,"Tissue atlas Arabidopsis - ProteomicsDB",114,32188942,"MaxQuant score",140.4100000,1.0000000,,,,7.4400398883591E-16,
EEVDHISNETEEHEHVLER,ph,T,628,true,"Tissue atlas Arabidopsis - ProteomicsDB",114,32188942,"MaxQuant score",140.4100000,1.0000000,,,,7.4400398883591E-16,
DVQQCETIESEAVETK,ox,C,642,true,"SPEAR - 10 mM H2O2 / mock",138a,34619326,,,,0.9956456,0.0169966,YES,,
TVFSSDEVR,ph,S,679,true,"STN8 phosphoproteome",38,21768351,"MASCOT Score",47.8300000,,,,,,0.5288970
TVFSSDEVR,ph,S,679,true,"Chloroplast kinase substrates",60,19376835,"MASCOT Score",31.3400000,,,,,,-0.0244381
TVFSSDEVR,ph,S,679,true,"srk2dei ABA signaling phopshoproteomics",83,23572148,"MASCOT Score",56.0000000,,,,,,-0.0001000
TVFSSDEVR,ph,S,679,true,"LAXIC - ABA stress",84a,23660473,XCorr,2.7100000,0.9950000,,,,0.00017626899352763,
TVFSSDEVR,ph,S,679,true,"LAXIC - mannitol vs control",84b,23660473,XCorr,2.5300000,0.9290000,,,,0.0020278699230403,
TVFSSDEVR,ph,S,679,true,"SnRK2 protein kinase substrates",85,23776212,XCorr,2.5686247,0.9570000,,,,0.00033460999839008,
TVFSSDEVR,ph,S,679,true,"atm and atr DNA damage response",88,25561503,"MASCOT Score",40.0000000,0.9600000,,,,,-0.8700000
TVFSSDEVR,ph,S,679,true,"TOR Kinase and ABA Receptor",100,29290610,XCorr,2.6977468,0.9965000,,,,0.0013089999556541,
TVFSSDEVR,ph,S,679,true,"Tissue atlas Arabidopsis - ProteomicsDB",114,32188942,"MaxQuant score",114.8600000,0.9700450,,,,0.00040676898788661,
SPSDLVLNVDKEELNDEK,ph,S,769,true,"srk2dei ABA signaling phopshoproteomics",83,23572148,"MASCOT Score",51.0000000,,,,,,-0.0012000
SPSDLVLNVDK,ph,S,769,true,"srk2dei ABA signaling phopshoproteomics",83,23572148,"MASCOT Score",80.0000000,,,,,,0.0015000
LESPSEVSEETSK,ph,S,847,true,"STN8 phosphoproteome",38,21768351,"MASCOT Score",89.0600000,,,,,,-1.0537400
LESPSEVSEETSK,ph,S,847,true,"Tyrosine phosphorylation in Arabidopsis",59,18463617,"MASCOT Score",48.0000000,,,,,,0.5331115
LESPSEVSEETSK,ph,S,847,true,"LAXIC - ABA stress",84a,23660473,XCorr,2.8600000,0.9990000,,,,0.00020462500106078,
LESPSEVSEETSK,ph,S,847,true,"SnRK2 protein kinase substrates",85,23776212,XCorr,3.1003959,1.0000000,,,,3.5766899486589E-7,
LESPSEVSEETSK,ph,S,847,true,"atm and atr DNA damage response",88,25561503,"MASCOT Score",25.0000000,1.0000000,,,,,-0.7400000
LESPSEVSEETSK,ph,S,847,true,"TOR Kinase and ABA Receptor",100,29290610,XCorr,3.7633348,1.0000000,,,,5.9720001445385E-5,
LESPSEVSEETSK,ph,S,847,true,"Lateral root-induction - NAA vs control",106,23328941,"MASCOT Score",38.0000000,,0.1050008,0.7277661,NO,,
LESPSEVSEETSK,ph,S,847,true,"Tissue atlas Arabidopsis - ProteomicsDB",114,32188942,"MaxQuant score",246.3100000,0.9999990,,,,0,
LESPSEVSEETSK,ph,S,849,true,"Tissue atlas Arabidopsis - ProteomicsDB",114,32188942,"MaxQuant score",102.5200000,0.9963610,,,,0.00019676200463437,
EETVSVPESIELEEQPQEER,ph,T,891,true,"SnRK2 protein kinase substrates",85,23776212,XCorr,4.2405667,0.9410000,,,,1.8656699296571E-8,
EETVSVPESIELEEQPQEER,ph,T,891,true,"Tissue atlas Arabidopsis - ProteomicsDB",114,32188942,"MaxQuant score",85.6360000,0.8642410,,,,1.3074500202492E-5,
EETVSVPESIELEEQPQEER,ph,S,893,true,"srk2dei ABA signaling phopshoproteomics",83,23572148,"MASCOT Score",32.0000000,,,,,,0.0015000
EETVSVPESIELEEQPQEER,ph,S,893,true,"LAXIC - mannitol vs control",84b,23660473,XCorr,4.8700000,0.9450000,,,,9.5499999588355E-5,
EETVSVPESIELEEQPQEER,ph,S,893,true,"SnRK2 protein kinase substrates",85,23776212,XCorr,3.6219182,0.9090000,,,,0.0074101598002017,
EETVSVPESIELEEQPQEER,ph,S,893,true,"Tissue atlas Arabidopsis - ProteomicsDB",114,32188942,"MaxQuant score",319.9900000,0.9989500,,,,0,
EETVSVPESIELEEQPQEER,ph,S,897,true,"LAXIC - ABA stress",84a,23660473,XCorr,3.0700000,0.9360000,,,,0.0078370999544859,
EETVSVPESIELEEQPQEER,ph,S,897,true,"LAXIC - mannitol vs control",84b,23660473,XCorr,4.8700000,0.9960000,,,,9.5499999588355E-5,
EETVSVPESIELEEQPQEER,ph,S,897,true,"SnRK2 protein kinase substrates",85,23776212,XCorr,3.6219182,0.9990000,,,,0.0074101598002017,
EETVSVPESIELEEQPQEER,ph,S,897,true,"Tissue atlas Arabidopsis - ProteomicsDB",114,32188942,"MaxQuant score",205.9200000,1.0000000,,,,0,
SVIDPTPLQKPTLESPSEVLEESSK,ph,S,923,true,"SnRK2 protein kinase substrates",85,23776212,XCorr,4.3651462,0.9930000,,,,0.0016734600067139,
SVIDPTPLQKPTLESPSEVLEESSK,ph,S,923,true,"TOR Kinase and ABA Receptor",100,29290610,XCorr,3.8829627,0.7935000,,,,0.00084619998233393,
TDSIELGEIAQEER,ph,S,945,true,"Tissue atlas Arabidopsis - ProteomicsDB",114,32188942,"MaxQuant score",110.3500000,0.9593750,,,,3.6986800751038E-6,
SVTDLTPLQEESSQPNEQEKETK,ph,S,957,true,"Tissue atlas Arabidopsis - ProteomicsDB",114,32188942,"MaxQuant score",194.6700000,0.9874770,,,,0,
HEPTNEEVKSDEVIEVLSASPSK,ph,T,986,true,"TOR Kinase and ABA Receptor",100,29290610,XCorr,4.3691511,0.9887000,,,,5.1279998842801E-6,
SDEVIEVLSASPSK,ph,S,1000,true,"Tyrosine phosphorylation in Arabidopsis",59,18463617,"MASCOT Score",56.0000000,,,,,,-0.3247373
SDEVIEVLSASPSK,ph,S,1000,true,"srk2dei ABA signaling phopshoproteomics",83,23572148,"MASCOT Score",22.0000000,,,,,,0.0008000
SDEVIEVLSASPSK,ph,S,1000,true,"Tissue atlas Arabidopsis - ProteomicsDB",114,32188942,"MaxQuant score",97.7970000,0.8101850,,,,0.00014551999629475,
SDEVIEVLSASPSK,ph,S,1002,true,"Tyrosine phosphorylation in Arabidopsis",59,18463617,"MASCOT Score",90.0000000,,,,,,-0.4546322
SDEVIEVLSASPSK,ph,S,1002,true,"srk2dei ABA signaling phopshoproteomics",83,23572148,"MASCOT Score",85.0000000,,,,,,0.0009000
SDEVIEVLSASPSK,ph,S,1002,true,"TOR Kinase and ABA Receptor",100,29290610,XCorr,5.5752773,0.9995000,,,,2.6380000690551E-6,
SDEVIEVLSASPSK,ph,S,1002,true,"Tissue atlas Arabidopsis - ProteomicsDB",114,32188942,"MaxQuant score",203.2000000,0.9962300,,,,1.4012984643248E-45,
SDEVIEVLSASPSK,ph,S,1004,true,"srk2dei ABA signaling phopshoproteomics",83,23572148,"MASCOT Score",55.0000000,,,,,,-0.0007000
SDEVIEVLSASPSK,ph,S,1004,true,"Tissue atlas Arabidopsis - ProteomicsDB",114,32188942,"MaxQuant score",159.1400000,0.7757460,,,,1.6019599535788E-10,
DIGPSLTE,nt,D,1098,true,"Arg/N-end rule seed, prt6 vs. Wt",99,29168982,"MASCOT Score",44.9100000,,-0.8734229,0.2058778,NO,0.042959999293089,-0.6698536
SINQNQPE,nt,S,1108,true,"Arg/N-end rule seed, prt6 vs. Wt",99,29168982,"MASCOT Score",51.6000000,,-0.7837193,0.0275822,NO,0.030160000547767,-0.4221828
TDAEPRLDAIEK,ph,T,1186,true,"Phosphorylation Early Elicitor Signaling",23,17317660,,,,,,,,
TLETNISEPEAMHSETSLDLK,ph,S,1349,true,"Tissue atlas Arabidopsis - ProteomicsDB",114,32188942,"MaxQuant score",130.4800000,0.9996460,,,,2.3901199622786E-20,
VDKEQKEAETVK,ph,T,1373,true,"LAXIC - mannitol vs control",84b,23660473,XCorr,2.1500000,1.0000000,,,,0.094053201377392,
DESQGSEESVEVK,ph,S,1411,true,"TOR Kinase and ABA Receptor",100,29290610,XCorr,4.1180453,0.9994000,,,,3.1899999157758E-5,
SKETVQGESSEEK,ph,S,1427,true,"Tissue atlas Arabidopsis - ProteomicsDB",114,32188942,"MaxQuant score",193.6400000,0.9602910,,,,4.2258499052174E-30,
SKETVQGESSEEK,ph,S,1428,true,"Tissue atlas Arabidopsis - ProteomicsDB",114,32188942,"MaxQuant score",167.3200000,0.8186290,,,,1.2235200340675E-14,
QSLDTPSEEETSK,ph,T,1499,true,"Lateral root-induction - NAA vs control",106,23328941,"MASCOT Score",24.0000000,,,,,,
QSLDTPSEEETSK,ph,S,1501,true,"STN8 phosphoproteome",38,21768351,"MASCOT Score",57.3700000,,,,,,0.8367680
QSLDTPSEEETSK,ph,S,1501,true,"LAXIC - ABA stress",84a,23660473,XCorr,2.3300000,0.9900000,,,,0.00011665700003505,
QSLDTPSEEETSK,ph,S,1501,true,"SnRK2 protein kinase substrates",85,23776212,XCorr,2.9933176,0.9960000,,,,0.0021030199714005,
QSLDTPSEEETSK,ph,S,1501,true,"atm and atr DNA damage response",88,25561503,"MASCOT Score",35.0000000,1.0000000,,,,,1.0900000
QSLDTPSEEETSK,ph,S,1501,true,"Lateral root-induction - NAA vs control",106,23328941,"MASCOT Score",36.0000000,,0.0038173,0.9370974,NO,,
QSLDTPSEEETSK,ph,S,1501,true,"Tissue atlas Arabidopsis - ProteomicsDB",114,32188942,"MaxQuant score",241.9800000,0.9998760,,,,0,
ELGEQPQQEELCLANEQENETK,ox,C,1560,true,"SPEAR - 50 mM H2O2 / mock",138b,34619326,,,,2.8346698,0.0044213,YES,,
GETKSSEAEDDKPDEHVDSSTSPMLSEK,ph,T,1729,true,"TOR Kinase and ABA Receptor",100,29290610,XCorr,5.3247685,0.8599000,,,,0.00011169999925187,
GETKSSEAEDDKPDEHVDSSTSPMLSEK,ph,S,1731,true,"TOR Kinase and ABA Receptor",100,29290610,XCorr,5.3247685,0.8599000,,,,0.00011169999925187,
SSEAEDDKPDEHVDSSTSPMLSEK,ph,S,1731,true,"Tissue atlas Arabidopsis - ProteomicsDB",114,32188942,"MaxQuant score",177.3400000,0.7969820,,,,0,
GETKSSEAEDDKPDEHVDSSTSPMLSEK,ph,S,1732,true,"PAMP-triggered phosphorylation",48,24601666,"MASCOT Score",31.5100000,,,,,,
GETKSSEAEDDKPDEHVDSSTSPMLSEK,ph,S,1732,true,"TOR Kinase and ABA Receptor",100,29290610,XCorr,4.8267016,0.7992000,,,,7.5010001410192E-7,
SQEISETIEEIEATSDQTLPIETSHTDNTLSSELVSEQDDQSPK,ph,S,1832,true,"SnRK2 protein kinase substrates",85,23776212,XCorr,5.6802053,0.9940000,,,,0.04117339849472,
EAHDVEATSERNLPVETSDADNTLSSQLVSETK,ph,S,1854,true,"TOR Kinase and ABA Receptor",100,29290610,XCorr,5.1155338,0.8304000,,,,0.00084130000323057,
EAHDVEATSER,ph,S,1854,true,"atm and atr DNA damage response",88,25561503,"MASCOT Score",23.0000000,1.0000000,,,,,0.6700000
EAHDVEATSER,ph,S,1854,true,"Tissue atlas Arabidopsis - ProteomicsDB",114,32188942,"MaxQuant score",175.2100000,0.7675940,,,,4.7564799321442E-12,
ESSDEALVSML,nt,E,1897,true,"Arg/N-end rule seed, prt6 vs. Wt",99,29168982,"MASCOT Score",34.9900000,,-0.0923833,0.8709653,NO,0.17290000617504,-4.4309433
ESSDEALVSM,nt,E,1897,true,"Arg/N-end rule seed, prt6 vs. Wt",99,29168982,"MASCOT Score",50.3000000,,0.0710016,0.5760687,NO,0.020029999315739,-1.6564645
LQAGEILPTEIIPRESSDEALVSMLASR,ph,S,1898,true,"TOR Kinase and ABA Receptor",100,29290610,XCorr,3.6656022,0.9916000,,,,0.090630002319813,
ESSDEALVSMLASR,ph,S,1898,true,"BSK8 and BSL2 regulating sucrose-ph synthase",66,24924143,"MaxQuant Score",134.6800000,,,,,,0.0951000
ESSDEALVSMLASR,ph,S,1898,true,"srk2dei ABA signaling phopshoproteomics",83,23572148,"MASCOT Score",66.0000000,,,,,,-0.0001000
LQAGEILPTEIIPRESSDEALVSMLASR,ph,S,1899,true,"TOR Kinase and ABA Receptor",100,29290610,XCorr,3.6656022,0.9723000,,,,0.090630002319813,
ESSDEALVSMLASREDDK,ph,S,1899,true,"srk2dei ABA signaling phopshoproteomics",83,23572148,"MASCOT Score",44.0000000,,,,,,0.0059000
ESSDEALVSMLASREDDK,ph,S,1899,true,"TOR Kinase and ABA Receptor",100,29290610,XCorr,2.8721931,0.8914000,,,,0.0005020999815315,
ESSDEALVSMLASR,ph,S,1899,true,"PAMP-triggered phosphorylation",48,24601666,"MASCOT Score",44.9700000,,,,,,
ESSDEALVSMLASR,ph,S,1899,true,"Tyrosine phosphorylation in Arabidopsis",59,18463617,"MASCOT Score",77.0000000,,,,,,-1.0802789
ESSDEALVSMLASR,ph,S,1899,true,"BSK8 and BSL2 regulating sucrose-ph synthase",66,24924143,"MaxQuant Score",134.6800000,,,,,,-0.1581800
ESSDEALVSMLASR,ph,S,1899,true,"srk2dei ABA signaling phopshoproteomics",83,23572148,"MASCOT Score",79.0000000,,,,,,0.0000000
ESSDEALVSMLASR,ph,S,1899,true,"LAXIC - ABA stress",84a,23660473,XCorr,3.6100000,0.9320000,,,,0.0092339301481843,
ESSDEALVSMLASR,ph,S,1899,true,"LAXIC - mannitol vs control",84b,23660473,XCorr,4.7400000,0.9500000,,,,3.1399999267379E-10,
ESSDEALVSMLASR,ph,S,1899,true,"SnRK2 protein kinase substrates",85,23776212,XCorr,4.2481518,0.9690000,,,,0.00032988100429066,
ESSDEALVSMLASR,ph,S,1899,true,"atm and atr DNA damage response",88,25561503,"MASCOT Score",78.0000000,0.9970000,,,,,-0.0400000
ESSDEALVSMLASR,ph,S,1899,true,"TOR Kinase and ABA Receptor",100,29290610,XCorr,4.9513774,0.9211000,,,,1.774999986992E-6,
ESSDEALVSMLASR,ph,S,1899,true,"Lateral root-induction - NAA vs control",106,23328941,"MASCOT Score",38.0000000,,-0.0995765,0.5793161,NO,,
ESSDEALVSMLASR,ph,S,1899,true,"Phospho cell culture sucrose/TOR",109,30833711,,,0.9653020,,,,,
ESSDEALVSMLASR,ph,S,1899,true,"Col-0 callus - FC Col-0 vs. Col-0 Xray",111a,31410901,,54.8700000,,0.2537251,0.0000000,NO,,0.6568340
ESSDEALVSMLASR,ph,S,1899,true,"Col-0 X-ray callus - FC Col-0 vs. Col-0 Xray",111b,31410901,,54.8700000,,0.2537251,0.0000000,NO,,0.6568340
ESSDEALVSMLASR,ph,S,1899,true,"atm callus - FC atm vs. atm Xray",111c,31410901,,54.8700000,,1.4781317,0.0000000,NO,,0.6568340
ESSDEALVSMLASR,ph,S,1899,true,"atm-3 X-ray callus - FC atm vs. atm Xray",111d,31410901,,54.8700000,,1.4781317,0.0000000,NO,,0.6568340
ESSDEALVSMLASR,ph,S,1899,true,"Tissue atlas Arabidopsis - ProteomicsDB",114,32188942,"MaxQuant score",205.0400000,0.9997810,,,,1.3088127656794E-42,
EDDKVALQEDNCADDVR,ox,C,1922,true,"SPEAR - 10 mM H2O2 / mock",138a,34619326,,,,1.3937854,0.0333175,YES,,
EDDKVALQEDNCADDVR,ox,C,1922,true,"SPEAR - 50 mM H2O2 / mock",138b,34619326,,,,1.5709143,0.0100354,YES,,
VALQEDNCADDVR,sno,C,1922,true,"Site-specific nitrosomeproteomic id - gsnor1-3",90a,25699590,XCorr,3.3732469,,,,,7.7860000601504E-5,-5.9508209
VALQEDNCADDVR,sno,C,1922,true,"Site-specific nitrosomeproteomic id - gsnor1-3",90b,25699590,XCorr,3.7400000,,,,,0.028300000354648,-6.2100000
SGEDEPVTPQEGDYAANTQEER,nt,S,2105,true,"Arg/N-end rule seed, prt6 vs. Wt",99,29168982,"MASCOT Score",33.0900000,,0.0308061,0.9505773,NO,0.049860000610352,-6.5247594
ESFIEAPVSMLASGEDEPVTPQEGDYAANTQEER,ph,T,2112,true,"srk2dei ABA signaling phopshoproteomics",83,23572148,"MASCOT Score",44.0000000,,,,,,-0.0066000
ESFIEAPVSMLASGEDEPVTPQEGDYAANTQEER,ph,T,2112,true,"SnRK2 protein kinase substrates",85,23776212,XCorr,4.6856675,0.9800000,,,,3.96250006599E-16,
ESFIEAPVSMLASGEDEPVTPQEGDYAANTQEER,ph,T,2112,true,"TOR Kinase and ABA Receptor",100,29290610,XCorr,5.8343916,0.9756000,,,,5.5550000155336E-8,
ESQAEGAEKSDDQVEDESTK,ph,S,2152,true,"Tissue atlas Arabidopsis - ProteomicsDB",114,32188942,"MaxQuant score",164.8300000,0.9999970,,,,3.4531401042976E-30,
SDDQVEDESTKK,ac,K,2162,true,"Quantitative Acetylproteomics",101,29440448,,,,,,,,
EIAQVLPR,nt,E,2297,true,"Arg/N-end rule seed, prt6 vs. Wt",99,29168982,"MASCOT Score",44.4500000,,-1.3066169,0.1260498,NO,0.066310003399849,-0.6369284
EPQQDFNGSTSEK,ph,S,2342,true,"Tissue atlas Arabidopsis - ProteomicsDB",114,32188942,"MaxQuant score",90.6890000,0.8123310,,,,0.00040011899545789,
ELEVGNDFVSR,ph,S,2414,true,"Tissue atlas Arabidopsis - ProteomicsDB",114,32188942,"MaxQuant score",79.0890000,1.0000000,,,,0.0013960199430585,
KASEAEHEDPVDDIK,ph,S,2454,true,"Tissue atlas Arabidopsis - ProteomicsDB",114,32188942,"MaxQuant score",113.6300000,1.0000000,,,,9.5185498594219E-7,
ASEAEHEDPVDDIKSNDDRDFPTEQAPK,ph,S,2467,true,"STN8 phosphoproteome",38,21768351,"MASCOT Score",61.1800000,,,,,,-1.9804400
ASEAEHEDPVDDIKSNDDRDFPTEQAPK,ph,S,2467,true,"PAMP-triggered phosphorylation",48,24601666,"MASCOT Score",53.2300000,,,,,,
ASEAEHEDPVDDIKSNDDRDFPTEQAPK,ph,S,2467,true,"Chloroplast kinase substrates",60,19376835,"MASCOT Score",51.0600000,,,,,,-0.7452600
ASEAEHEDPVDDIKSNDDRDFPTEQAPK,ph,S,2467,true,"srk2dei ABA signaling phopshoproteomics",83,23572148,"MASCOT Score",52.0000000,,,,,,-0.0005000
ASEAEHEDPVDDIKSNDDRDFPTEQAPK,ph,S,2467,true,"SnRK2 protein kinase substrates",85,23776212,XCorr,4.6790104,0.9980000,,,,0.0036553400568664,
ASEAEHEDPVDDIKSNDDRDFPTEQAPK,ph,S,2467,true,"TOR Kinase and ABA Receptor",100,29290610,XCorr,3.7363691,0.9996000,,,,0.0019980000797659,
ASEAEHEDPVDDIKSNDDRDFPTEQAPK,ph,S,2467,true,"Phospho cell culture sucrose/TOR",109,30833711,,,0.9960680,,,,,
ASEAEHEDPVDDIKSNDDRDFPTEQAPK,ph,S,2467,true,"Touch-induced phosphorylation: 40s touch vs untouc",136,30291188,"MASCOT score",47.3000000,,0.0041025,0.9809308,NO,,1.8553654
KASEAEHEDPVDDIKSNDDR,ph,S,2467,true,"Tissue atlas Arabidopsis - ProteomicsDB",114,32188942,"MaxQuant score",400.7900000,1.0000000,,,,0,
ASEAEHEDPVDDIKSNDDR,ph,S,2467,true,"STN8 phosphoproteome",38,21768351,"MASCOT Score",62.4300000,,,,,,-0.7742760
ASEAEHEDPVDDIKSNDDR,ph,S,2467,true,"Chloroplast kinase substrates",60,19376835,"MASCOT Score",59.8300000,,,,,,-0.8282350
ASEAEHEDPVDDIKSNDDR,ph,S,2467,true,"SnRK2 protein kinase substrates",85,23776212,XCorr,3.3098207,1.0000000,,,,0.03505339846015,
SNDDRDFPTEQAPK,ph,S,2467,true,"srk2dei ABA signaling phopshoproteomics",83,23572148,"MASCOT Score",37.0000000,,,,,,-0.0001000
SNDDRDFPTEQAPK,ph,S,2467,true,"TOR Kinase and ABA Receptor",100,29290610,XCorr,2.2724178,1.0000000,,,,0.002515000058338,
ASEAEHEDPVDDIKSNDDRDFPTEQAPK,ph,T,2475,true,"LAXIC - mannitol vs control",84b,23660473,XCorr,4.2500000,0.9010000,,,,6.2000000689011E-9,
DQSDEVSADETVPK,ph,S,2483,true,"srk2dei ABA signaling phopshoproteomics",83,23572148,"MASCOT Score",37.0000000,,,,,,0.0027000
DQSDEVSADETVPK,ph,S,2483,true,"Lateral root-induction - NAA vs control",106,23328941,"MASCOT Score",27.0000000,,,,,,
DQSDEVSADETVPK,ph,S,2483,true,"Tissue atlas Arabidopsis - ProteomicsDB",114,32188942,"MaxQuant score",136.5700000,1.0000000,,,,1.8345499483985E-5,
DQSDEVSADETVPK,ph,S,2487,true,"STN8 phosphoproteome",38,21768351,"MASCOT Score",62.2200000,,,,,,-1.9956800
DQSDEVSADETVPK,ph,S,2487,true,"Tyrosine phosphorylation in Arabidopsis",59,18463617,"MASCOT Score",98.0000000,,,,,,-0.5004272
DQSDEVSADETVPK,ph,S,2487,true,"Chloroplast kinase substrates",60,19376835,"MASCOT Score",41.6200000,,,,,,-0.5962470
DQSDEVSADETVPK,ph,S,2487,true,"srk2dei ABA signaling phopshoproteomics",83,23572148,"MASCOT Score",85.0000000,,,,,,0.0002000
DQSDEVSADETVPK,ph,S,2487,true,"LAXIC - ABA stress",84a,23660473,XCorr,3.1500000,0.9990000,,,,0.0016460299957544,
DQSDEVSADETVPK,ph,S,2487,true,"LAXIC - mannitol vs control",84b,23660473,XCorr,2.8600000,1.0000000,,,,2.1700000019109E-8,
DQSDEVSADETVPK,ph,S,2487,true,"SnRK2 protein kinase substrates",85,23776212,XCorr,3.0290878,1.0000000,,,,1.1840599654533E-5,
DQSDEVSADETVPK,ph,S,2487,true,"TOR Kinase and ABA Receptor",100,29290610,XCorr,4.1888995,0.9994000,,,,1.0519999705139E-5,
DQSDEVSADETVPK,ph,S,2487,true,"Lateral root-induction - NAA vs control",106,23328941,"MASCOT Score",26.0000000,,,,,,
DQSDEVSADETVPK,ph,S,2487,true,"Tissue atlas Arabidopsis - ProteomicsDB",114,32188942,"MaxQuant score",275.3100000,1.0000000,,,,0,
DQSDEVSADETVPK,ph,T,2491,true,"srk2dei ABA signaling phopshoproteomics",83,23572148,"MASCOT Score",27.0000000,,,,,,-0.0009000
EAIGEELKVPSSK,ph,S,2505,true,"Tissue atlas Arabidopsis - ProteomicsDB",114,32188942,"MaxQuant score",133.8700000,0.8757400,,,,8.9298402599525E-5,
DLPVQNLSELIQSH,nt,D,2528,true,"Arg/N-end rule seed, prt6 vs. Wt",99,29168982,"MASCOT Score",70.7900000,,0.0480090,0.9150784,NO,0.0001470999995945,-2.8668967
DLPVQNLSE,nt,D,2528,true,"Arg/N-end rule seed, prt6 vs. Wt",99,29168982,"MASCOT Score",47.6200000,,-0.8447355,0.1064299,NO,0.0023429999127984,0.5487160
DLPVQNLSELIQSHQSPNQVEETSFEFNK,ph,S,2543,true,"Large-scale phosphorylation discovery",44,23111157,XCorr,4.6880000,,,,,,
DLPVQNLSELIQSHQSPNQVEETSFEFNK,ph,S,2543,true,"SnRK2 protein kinase substrates",85,23776212,XCorr,5.5001926,0.9620000,,,,3.2129901228473E-5,
DLPVQNLSELIQSHQSPNQVEETSFEFNK,ph,S,2543,true,"TOR Kinase and ABA Receptor",100,29290610,XCorr,3.5026240,0.8973000,,,,0.0048890002071857,
EETSSIEEKR,ph,S,2639,true,"Tissue atlas Arabidopsis - ProteomicsDB",114,32188942,"MaxQuant score",76.3320000,0.8178140,,,,0.002930480055511,
EINQESFNNVKETDDAIDK,ph,S,2707,true,"Tissue atlas Arabidopsis - ProteomicsDB",114,32188942,"MaxQuant score",65.7530000,0.9999290,,,,0.00012158900062786,
DIESLSSVSK,ph,S,2730,true,"Tissue atlas Arabidopsis - ProteomicsDB",114,32188942,"MaxQuant score",93.2580000,0.9898880,,,,0.00083414698019624,
DIESLSSVSK,ph,S,2732,true,"Tissue atlas Arabidopsis - ProteomicsDB",114,32188942,"MaxQuant score",143.7900000,0.8517880,,,,6.2931400179878E-7,
DIESLSSVSK,ph,S,2733,true,"srk2dei ABA signaling phopshoproteomics",83,23572148,"MASCOT Score",42.0000000,,,,,,0.0003000
DIESLSSVSK,ph,S,2733,true,"Tissue atlas Arabidopsis - ProteomicsDB",114,32188942,"MaxQuant score",124.8000000,0.8618340,,,,1.4342800061277E-34,
SLSDHIQKEPK,ph,S,2802,true,"Arabidopsis root NAA phosphoproteome",18a,27643528,"MaxQuant Score",45.2800000,0.8540000,,,,0.0020000000949949,-1.5530000
SLSDHIQKEPK,ph,S,2802,true,"STN8 phosphoproteome",38,21768351,"MASCOT Score",48.6500000,,,,,,-0.6247970
SLSDHIQKEPK,ph,S,2802,true,"Phosphoproteome ethylene-regulated time response",46,24043427,"MASCOT Score",35.3700000,,,,,,-3.9961000
SLSDHIQKEPK,ph,S,2802,true,"Chloroplast kinase substrates",60,19376835,"MASCOT Score",40.2200000,,,,,,-0.6247970
SLSDHIQKEPK,ph,S,2802,true,"Col-0 callus - FC Col-0 vs. Col-0 Xray",111a,31410901,,20.0300000,,-0.6898405,0.0000000,NO,,0.0448647
SLSDHIQKEPK,ph,S,2802,true,"Col-0 X-ray callus - FC Col-0 vs. Col-0 Xray",111b,31410901,,20.0300000,,-0.6898405,0.0000000,NO,,0.0448647
SLSDHIQKEPK,ph,S,2802,true,"atm callus - FC atm vs. atm Xray",111c,31410901,,20.0300000,,-1.4875289,0.0000000,NO,,0.0448647
SLSDHIQKEPK,ph,S,2802,true,"atm-3 X-ray callus - FC atm vs. atm Xray",111d,31410901,,20.0300000,,-1.4875289,0.0000000,NO,,0.0448647
SLSDHIQKEPK,ph,S,2802,true,"Tissue atlas Arabidopsis - ProteomicsDB",114,32188942,"MaxQuant score",211.8300000,1.0000000,,,,5.7579800567174E-25,
KSLSDHIQK,ph,S,2802,true,"atm and atr DNA damage response",88,25561503,"MASCOT Score",41.0000000,0.9510000,,,,,-0.6800000
SLSDHIQK,ph,S,2802,true,"STN8 phosphoproteome",38,21768351,"MASCOT Score",42.3500000,,,,,,-0.0311190
SLSDHIQK,ph,S,2802,true,"Tyrosine phosphorylation in Arabidopsis",59,18463617,"MASCOT Score",36.0000000,,,,,,-0.4967967