Peptide,PTM,ModifiedAA,ModifiedPosition,PeptideUniqueToGene,ExperimentDesc,ExpID,PubmedID,ScoreType,IdentScore,LocProb,Log2FChange,PQ-val,QuantSig,PEP,MassErrorPPM
VSDNGEKKSDVVVDVDEK,ph,S,50,true,"TOR Kinase and ABA Receptor",100,29290610,XCorr,3.5150113,0.9983000,,,,0.00015419999544974,
KSDVVVDVDEKNEK,ph,S,50,true,"Tissue atlas Arabidopsis - ProteomicsDB",114,32188942,"MaxQuant score",125.3500000,1.0000000,,,,2.8229500714013E-14,
KHEFDSPLVNNAGIK,ph,S,234,true,"Tissue atlas Arabidopsis - ProteomicsDB",114,32188942,"MaxQuant score",61.0960000,1.0000000,,,,0.00026877000345849,
SRVEEVAALDHEESSSLQR,ph,S,357,true,"Tissue atlas Arabidopsis - ProteomicsDB",114,32188942,"MaxQuant score",139.6900000,0.8729740,,,,4.5420899680293E-11,
SITEIIEKESAAK,ph,S,392,true,"Tissue atlas Arabidopsis - ProteomicsDB",114,32188942,"MaxQuant score",154.1900000,1.0000000,,,,1.5169300260354E-9,
FETEPADGDVKSNVK,ph,S,409,true,"Tissue atlas Arabidopsis - ProteomicsDB",114,32188942,"MaxQuant score",84.7120000,0.9999990,,,,0.00032503198599443,
MDVDDGDDDGSGDKEESEEK,ph,S,480,true,"TOR Kinase and ABA Receptor",100,29290610,XCorr,5.8165407,1.0000000,,,,0.00033949999487959,
KMDVDDGDDDGSGDKEESEEK,ph,S,486,true,"TOR Kinase and ABA Receptor",100,29290610,XCorr,4.6395826,0.9769000,,,,6.8130000727251E-5,
MDVDDGDDDGSGDKEESEEK,ph,S,486,true,"TOR Kinase and ABA Receptor",100,29290610,XCorr,5.8165407,1.0000000,,,,0.00033949999487959,
EISDLEINIDSTSLASLR,ph,S,492,true,"Tissue atlas Arabidopsis - ProteomicsDB",114,32188942,"MaxQuant score",194.0500000,1.0000000,,,,2.8025969286496E-45,
FDDSVVER,ph,S,515,true,"Tissue atlas Arabidopsis - ProteomicsDB",114,32188942,"MaxQuant score",78.4880000,1.0000000,,,,0.009891290217638,
VSSQSQVDER,ph,S,568,true,"atm and atr DNA damage response",88,25561503,"MASCOT Score",41.0000000,0.9390000,,,,,-1.3600000
EELSEMGKPVTK,ph,S,686,true,"Tissue atlas Arabidopsis - ProteomicsDB",114,32188942,"MaxQuant score",221.5200000,1.0000000,,,,4.2686395859217E-39,
KQSDGEEETQKEPSESTK,ph,S,772,true,"STN8 phosphoproteome",38,21768351,"MASCOT Score",57.6900000,,,,,,-1.1666000
KQSDGEEETQKEPSESTK,ph,S,772,true,"Chloroplast kinase substrates",60,19376835,"MASCOT Score",40.5800000,,,,,,1.8491100
KQSDGEEETQKEPSESTK,ph,S,772,true,"SnRK2 protein kinase substrates",85,23776212,XCorr,4.2338471,1.0000000,,,,7.1260699563425E-9,
KQSDGEEETQKEPSESTK,ph,S,772,true,"TOR Kinase and ABA Receptor",100,29290610,XCorr,4.7208867,1.0000000,,,,6.5979997998511E-7,
KQSDGEEETQKEPSESTK,ph,S,772,true,"Phospho cell culture sucrose/TOR",109,30833711,,,0.9999840,,,,,
KQSDGEEETQKEPSESTK,ph,S,772,true,"Tissue atlas Arabidopsis - ProteomicsDB",114,32188942,"MaxQuant score",282.3800000,1.0000000,,,,0,
KQSDGEEETQK,ph,S,772,true,"atm and atr DNA damage response",88,25561503,"MASCOT Score",39.0000000,1.0000000,,,,,0.6700000
LEGEMVNLLEKVIEMRSS,ub,K,1001,true,"Protein ubiquitination during photomorphogenesis",3,28461270,,,,,,,,
