Peptide,PTM,ModifiedAA,ModifiedPosition,PeptideUniqueToGene,ExperimentDesc,ExpID,PubmedID,ScoreType,IdentScore,LocProb,Log2FChange,PQ-val,QuantSig,PEP,MassErrorPPM
LSGNENPSVADLKK,ph,S,19,true,"Phospho cell culture sucrose/TOR",109,30833711,,,0.9998810,,,,,
LSGNENPSVADLKK,ph,S,19,true,"Tissue atlas Arabidopsis - ProteomicsDB",114,32188942,"MaxQuant score",99.2840000,1.0000000,,,,0.00010378199658589,
MAALSSGGGAVAVASGGGGGAAPAAEPASVESK,ph,S,90,true,"Brassinosteroid-Regulated Phosphorylation Dynamics",94,26187819,"MaxQuant Score",111.1500000,1.0000000,,,,4.0450000797889E-14,0.6670000
MAALSSGGGAVAVASGGGGGAAPAAEPASVESK,ph,S,90,true,"Tissue atlas Arabidopsis - ProteomicsDB",114,32188942,"MaxQuant score",148.9400000,0.9723060,,,,0,
MAALSSGGGAVAVASGGGGGAAPAAEPASVESK,ph,S,93,true,"Brassinosteroid-Regulated Phosphorylation Dynamics",94,26187819,"MaxQuant Score",111.1500000,1.0000000,,,,4.0450000797889E-14,0.6670000
KKEEEKEESEDDGGMMSLFD,ph,S,103,true,"atm and atr DNA damage response",88,25561503,"MASCOT Score",37.0000000,0.9970000,,,,,-1.2400000
KEEEKEESEDDGGMMSLFD,ph,S,103,true,"Phospho cell culture sucrose/TOR",109,30833711,,,1.0000000,,,,,
EESEDDGGMMSLFD,ph,S,103,true,"srk2dei ABA signaling phopshoproteomics",83,23572148,"MASCOT Score",20.0000000,,,,,,0.0005000
EESEDDGGMMSLFD,ph,S,103,true,"Brassinosteroid-Regulated Phosphorylation Dynamics",94,26187819,"MaxQuant Score",132.7600000,1.0000000,,,,0.00033310000435449,-1.2830000
EESEDDGGMMSLFD,ph,S,103,true,"TOR Kinase and ABA Receptor",100,29290610,XCorr,4.7621918,1.0000000,,,,1.3390000503932E-6,
