Peptide,PTM,ModifiedAA,ModifiedPosition,PeptideUniqueToGene,ExperimentDesc,ExpID,PubmedID,ScoreType,IdentScore,LocProb,Log2FChange,PQ-val,QuantSig,PEP,MassErrorPPM
SDVFDGYERQ,nt,S,2,true,"N-term acetylation drought responses",5,26184543,,,,,,,,
SDVFDGYERQ,nta,S,2,true,"N-term acetylation drought responses",5,26184543,,,,,,,,
SDVFDGYER,nta,S,2,true,"Characterization plant N-terminal acetylation",6,22223895,"MASCOT Score",53.5400000,,,,,,
SDVFDGYER,nta,S,2,true,"FtsH12 N-terminome: WT / FtsH12 knockdown miRNA",118,33216923,"MaxQuant score",44.2640000,,,,,0.004388100001961,
SDVFDGYER,nta,S,2,true,"HUNTER N-terminome: legumain, GluC and trypsin",119,31951383,"MaxQuant score",124.0800000,,,,,,
SDVFDGYE,nta,S,2,true,"HUNTER N-terminome: legumain, GluC and trypsin",119,31951383,"MaxQuant score",157.8600000,,,,,,
QYCELSASLSK,ph,S,18,true,"Tissue atlas Arabidopsis - ProteomicsDB",114,32188942,"MaxQuant score",127.7100000,0.9711150,,,,9.2422696980066E-6,
QYCELSASLSKK,ub,K,21,true,"Ubiquitination Membrane Proteins",120,33585938,,,,,,,,
CSSAISLDGEQK,sno,C,23,true,"hot5-4 / wildtype, FAT-switch S-nitrosoproteome",169,37277371,,,,,,,,
KCSSAISLDGEQK,ph,S,25,true,"atm and atr DNA damage response",88,25561503,"MASCOT Score",50.0000000,0.9540000,,,,,-0.4000000
KCSSAISLDGEQK,ph,S,25,true,"Tissue atlas Arabidopsis - ProteomicsDB",114,32188942,"MaxQuant score",139.4900000,0.9559500,,,,1.3161599781597E-5,
CSSAISLDGEQK,ph,S,25,true,"atm and atr DNA damage response",88,25561503,"MASCOT Score",48.0000000,0.9940000,,,,,-0.7400000
LSEIKSGLENAEVLIR,ub,K,42,true,"Ubiquitination Membrane Proteins",120,33585938,,,,,,,,
LSEIKSGLENAEVLIR,ub,K,42,true,"upl3 mutant / wildtype",168,35926874,"MaxQuant score",134.1400000,1.0000000,-0.4819685,0.0685780,NO,8.7520598407442E-12,0.9949500
SSLLVKLR,ac,K,73,false,"Quantitative Acetylproteomics",101,29440448,,,,,,,,
SSLLVKLR,ub,K,73,false,"Ubiquitination Membrane Proteins",120,33585938,,,,,,,,
LREFKSDLNNFK,ac,K,78,true,"Quantitative Acetylproteomics",101,29440448,,,,,,,,
EFKSDLNNFK,ac,K,78,true,"Quantitative Acetylproteomics",101,29440448,,,,,,,,
LREFKSDLNNFK,ph,S,79,true,"Tissue atlas Arabidopsis - ProteomicsDB",114,32188942,"MaxQuant score",54.2370000,1.0000000,,,,0.0085586002096534,
EFKSDLNNFK,ph,S,79,true,"atm and atr DNA damage response",88,25561503,"MASCOT Score",26.0000000,1.0000000,,,,,-1.4300000
SDLNNFKTEVK,ac,K,85,false,"Quantitative Acetylproteomics",101,29440448,,,,,,,,
ITSGQLNAAAR,ph,S,93,true,"atm and atr DNA damage response",88,25561503,"MASCOT Score",47.0000000,0.9970000,,,,,-0.7900000
ITSGQLNAAAR,ph,S,93,true,"Tissue atlas Arabidopsis - ProteomicsDB",114,32188942,"MaxQuant score",119.0300000,0.9998450,,,,2.5848299628706E-5,
DELLEAGMADTKTASADQR,ph,T,112,true,"Tissue atlas Arabidopsis - ProteomicsDB",114,32188942,"MaxQuant score",68.5670000,0.8148640,,,,0.00016640999820083,
DELLEAGMADTKTASADQR,ub,K,113,true,"Arabidopsis ubiquitination COFRADIC",40,26744219,"MaxQuant Score",83.4230000,1.0000000,,,,5.4350000350679E-15,0.5190000
DELLEAGMADTKTASADQR,ub,K,113,true,"Ubiquitination Membrane Proteins",120,33585938,,,,,,,,
DELLEAGMADTKTASADQR,ub,K,113,true,"upl3 mutant / wildtype",168,35926874,"MaxQuant score",131.4500000,1.0000000,-0.3022262,0.5221800,NO,2.1901099877609E-15,0.7938400
AHETLHGVDDNIGK,ph,T,171,true,"Tissue atlas Arabidopsis - ProteomicsDB",114,32188942,"MaxQuant score",133.7800000,1.0000000,,,,1.2315300409682E-5,
AHETLHGVDDNIGKSKK,ub,K,181,true,"Ubiquitination Membrane Proteins",120,33585938,,,,,,,,
KILTDMTR,ub,K,184,true,"upl3 mutant / wildtype",168,35926874,"MaxQuant score",67.8970000,1.0000000,-0.2009127,0.8032800,NO,0.010117299854755,2.1983000
