Peptide,PTM,ModifiedAA,ModifiedPosition,PeptideUniqueToGene,ExperimentDesc,ExpID,PubmedID,ScoreType,IdentScore,LocProb,Log2FChange,PQ-val,QuantSig,PEP,MassErrorPPM
MNPTQKPEPVYDMVILGASGFTGKYVVR,nta,M,1,true,"HUNTER N-terminome: legumain, GluC and trypsin",119,31951383,"MaxQuant score",,,,,,,
MNPTQKPEPVYDMVILGASGFTGK,nta,M,1,true,"Characterization plant N-terminal acetylation",6,22223895,"MASCOT Score",80.6000000,,,,,,
MNPTQKPEPVYD,nta,M,1,true,"N-terminal ChaFRADIC",92,26010716,"MASCOT Score",25.7200000,,,,,0.030729999765754,
MNPTQKPEPVYD,nta,M,1,true,"Arg/N-end rule seed, prt6 vs. Wt",99,29168982,"MASCOT Score",48.8300000,,-0.1148540,0.2168995,NO,1.016999976855E-5,-2.3024705
MNPTQKPEPVYD,nta,M,1,true,"HUNTER N-terminome: legumain, GluC and trypsin",119,31951383,"MaxQuant score",53.7510000,,,,,,
FLQTPSSSPLK,ph,S,40,true,"Tissue atlas Arabidopsis - ProteomicsDB",114,32188942,"MaxQuant score",109.7200000,0.8471860,,,,3.4348900953773E-5,
GFDSIPAE,nt,G,153,true,"Arg/N-end rule seed, prt6 vs. Wt",99,29168982,"MASCOT Score",29.3700000,,-1.4008109,0.0226011,YES,0.039760001003742,0.2170103
PTICGPPAK,so,C,227,true,"Arabidopsis S-sulfenylation chemoproteomics",108,31578252,"pFind PSM Score",0.2251230,,,,,,1.3796019
TLTTLTEKPHGLPGINESPEQIQKR,ac,K,283,true,"Quantitative Acetylproteomics",101,29440448,,,,,,,,
FSFGR,ph,S,325,false,"srk2dei ABA signaling phopshoproteomics",83,23572148,"MASCOT Score",27.0000000,,,,,,0.0004000
