Peptide,PTM,ModifiedAA,ModifiedPosition,PeptideUniqueToGene,ExperimentDesc,ExpID,PubmedID,ScoreType,IdentScore,LocProb,Log2FChange,PQ-val,QuantSig,PEP,MassErrorPPM
STREENVYMA,nt,S,2,true,"N-term acetylation drought responses",5,26184543,,,,,,,,
STREENVYMAKLAEQAER,nta,S,2,true,"Arabidopsis translation initiation landscape - NTA",167a,35069635,,,,,,,,
STREENVYMA,nta,S,2,true,"N-term acetylation drought responses",5,26184543,,,,,,,,
STREENVYMAK,ph,S,2,true,"Phospho cell culture sucrose/TOR",109,30833711,,,0.8793920,,,,,
STREENVYMAK,ph,S,2,true,"Tissue atlas Arabidopsis - ProteomicsDB",114,32188942,"MaxQuant score",52.1320000,0.7860840,,,,0.0048458301462233,
EENVYMAKLAEQAER,nt,E,5,true,"Arabidopsis translation initiation landscape - NT",167b,35069635,,,,,,,,
STREENVYMAK,ph,Y,9,true,"atm and atr DNA damage response",88,25561503,"MASCOT Score",26.0000000,0.9550000,,,,,-0.3800000
NLLSVAYK,ph,S,48,false,"atm and atr DNA damage response",88,25561503,"MASCOT Score",39.0000000,1.0000000,,,,,-1.2400000
VAYKNVIGAR,nt,V,49,false,"Arabidopsis translation initiation landscape - NT",167b,35069635,,,,,,,,
NLLSVAYKNVIGAR,ub,K,52,false,"Ubiquitination Membrane Proteins",120,33585938,,,,,,,,
NLLSVAYKNVIGAR,ub,K,52,false,"upl3 mutant / wildtype",168,35926874,"MaxQuant score",170.0000000,1.0000000,0.5616927,0.4645800,NO,6.5853397047453E-17,-0.1572200
IISSIEQKEESK,ac,K,71,true,"Quantitative Acetylproteomics",101,29440448,,,,,,,,
GNEDHVAIIKDYR,ac,K,85,true,"Quantitative Acetylproteomics",101,29440448,,,,,,,,
ICDGILNVLEAHLIPSASPAESK,ox,C,99,true,"OxiTRAQ SA and flg22 responses - SA vs mock",91a,25720653,"MASCOT Score",47.6600000,,0.7311832,0.0080000,YES,,
ICDGILNVLEAHLIPSASPAESK,ox,C,99,true,"OxiTRAQ SA and flg22 responses - flg22 vs mock",91b,25720653,"MASCOT Score",47.6600000,,0.2986583,0.4320000,NO,,
ICDGILNVLEAHLIPSASPAESK,so,C,99,true,"S-sulfenylation site detection using YAP1C",110,32714340,,,,,,,,
DGILNVLE,nt,D,100,true,"Arg/N-end rule seed, prt6 vs. Wt",99,29168982,"MASCOT Score",46.3300000,,-0.3956310,0.4654960,NO,0.031490001827478,-1.1551005
SKVFYLKMKGDYHRYLAE,nt,S,119,false,"Arabidopsis translation initiation landscape - NT",167b,35069635,,,,,,,,
LKMKGDYHRYLAE,nt,L,124,false,"Arabidopsis translation initiation landscape - NT",167b,35069635,,,,,,,,
VFYLKMK,ac,K,125,false,"Quantitative Acetylproteomics",101,29440448,,,,,,,,
KEAAESTLVAYK,ub,K,144,false,"upl3 mutant / wildtype",168,35926874,"MaxQuant score",125.5300000,1.0000000,0.5439907,0.3374400,NO,1.4724900211149E-5,1.3224000
STLVAYK,nt,S,149,false,"Arg/N-end rule seed, prt6 vs. Wt",99,29168982,"MASCOT Score",21.1000000,,-0.0873289,0.4389741,NO,0.0052269999869168,-0.7113890
SASDIATAE,nt,S,156,true,"Arg/N-end rule seed, prt6 vs. Wt",99,29168982,"MASCOT Score",28.5800000,,-0.0423340,0.7665195,NO,0.05434999987483,0.4916952
SASDIATAELAPTHPIR,ph,S,156,true,"atm and atr DNA damage response",88,25561503,"MASCOT Score",60.0000000,0.9180000,,,,,0.1400000
SASDIATAELAPTHPIR,ph,S,156,true,"Tissue atlas Arabidopsis - ProteomicsDB",114,32188942,"MaxQuant score",216.7100000,0.9586200,,,,0,
EILNSPDR,nt,E,185,false,"Arg/N-end rule seed, prt6 vs. Wt",99,29168982,"MASCOT Score",50.3000000,,,,,0.042410001158714,-0.6662931
ACSLAK,sno,C,194,false,"hot5-4 / wildtype, FAT-switch S-nitrosoproteome",169,37277371,,,,,,,,
QAFDDAIAE,nt,Q,199,false,"Arg/N-end rule seed, prt6 vs. Wt",99,29168982,"MASCOT Score",44.8200000,,-1.0457460,0.0886034,NO,0.01566999964416,-1.9573617
AFDDAIAE,nt,A,200,false,"Arg/N-end rule seed, prt6 vs. Wt",99,29168982,"MASCOT Score",30.7100000,,-0.8228936,0.1078746,NO,0.045159999281168,-0.3945128
DNLTLWTSDMTDEAGDEIKEASKPDGAE,ph,S,235,true,"LAXIC - ABA stress",84a,23660473,XCorr,5.9300000,0.8100000,,,,0.0016022199997678,
DNLTLWTSDMTDEAGDEIKEASKPDGAE,ph,S,235,true,"SnRK2 protein kinase substrates",85,23776212,XCorr,4.6285658,0.7540000,,,,1.4691899760783E-15,
DNLTLWTSDMTDEAGDEIK,ph,S,235,true,"srk2dei ABA signaling phopshoproteomics",83,23572148,"MASCOT Score",47.0000000,,,,,,0.0004000
DNLTLWTSDMTDEAGDEIKEASKPDGAE,ph,T,238,true,"Arabidopsis root NAA phosphoproteome",18a,27643528,"MaxQuant Score",92.4120000,0.9570000,,,,1.5930000374365E-12,-0.2430000
DNLTLWTSDMTDEAGDEIKEASKPDGAE,ph,T,238,true,"SnRK2 protein kinase substrates",85,23776212,XCorr,5.7040162,0.8890000,,,,0.00079345901031047,
DNLTLWTSDMTDEAGDEIK,ph,T,238,true,"Large-scale phosphorylation discovery",44,23111157,XCorr,5.6940000,,,,,,
DNLTLWTSDMTDEAGDEIK,ph,T,238,true,"Tyrosine phosphorylation in Arabidopsis",59,18463617,"MASCOT Score",87.0000000,,,,,,-0.8956917
DNLTLWTSDMTDEAGDEIK,ph,T,238,true,"Chloroplast kinase substrates",60,19376835,"MASCOT Score",55.4900000,,,,,,-1.3129600
DNLTLWTSDMTDEAGDEIK,ph,T,238,true,"BSK8 and BSL2 regulating sucrose-ph synthase",66,24924143,"MaxQuant Score",179.3300000,,,,,,-0.7241800
DNLTLWTSDMTDEAGDEIK,ph,T,238,true,"srk2dei ABA signaling phopshoproteomics",83,23572148,"MASCOT Score",98.0000000,,,,,,-0.0003000
DNLTLWTSDMTDEAGDEIK,ph,T,238,true,"LAXIC - ABA stress",84a,23660473,XCorr,5.5200000,1.0000000,,,,4.8999999613386E-9,
DNLTLWTSDMTDEAGDEIK,ph,T,238,true,"SnRK2 protein kinase substrates",85,23776212,XCorr,5.1080022,1.0000000,,,,3.4991900056767E-14,
DNLTLWTSDMTDEAGDEIK,ph,T,238,true,"TOR Kinase and ABA Receptor",100,29290610,XCorr,5.9057369,0.9925000,,,,6.7390003299916E-11,
DNLTLWTSDMTDEAGDEIK,ph,T,238,true,"Phospho cell culture sucrose/TOR",109,30833711,,,0.9999940,,,,,
DNLTLWTSDMTDEAGDEIK,ph,T,238,true,"Col-0 callus - FC Col-0 vs. Col-0 Xray",111a,31410901,,89.2000000,,1.5976733,0.0000000,NO,,0.5958766
DNLTLWTSDMTDEAGDEIK,ph,T,238,true,"Col-0 X-ray callus - FC Col-0 vs. Col-0 Xray",111b,31410901,,89.2000000,,1.5976733,0.0000000,NO,,0.5958766
DNLTLWTSDMTDEAGDEIK,ph,T,238,true,"atm callus - FC atm vs. atm Xray",111c,31410901,,89.2000000,,1.7439353,0.0000000,NO,,0.5958766
DNLTLWTSDMTDEAGDEIK,ph,T,238,true,"atm-3 X-ray callus - FC atm vs. atm Xray",111d,31410901,,89.2000000,,1.7439353,0.0000000,NO,,0.5958766
DNLTLWTSDMTDEAGDEIK,ph,T,238,true,"Tissue atlas Arabidopsis - ProteomicsDB",114,32188942,"MaxQuant score",214.3000000,0.9999580,,,,0,
DNLTLWTSDMTDEAGDEIK,ph,T,238,true,"Touch-induced phosphorylation: 40s touch vs untouc",136,30291188,"MASCOT score",100.4700000,,-0.1258245,0.6803076,NO,,6.5498625
