Peptide,PTM,ModifiedAA,ModifiedPosition,PeptideUniqueToGene,ExperimentDesc,ExpID,PubmedID,ScoreType,IdentScore,LocProb,Log2FChange,PQ-val,QuantSig,PEP,MassErrorPPM
ADQLTDEQISEFKEAF,nta,A,2,false,"Arg/N-end rule pathway Roots",80,25728785,"MASCOT Score",33.8800000,,,,,0.16320000588894,
ADQLTDEQISEFKEAF,nta,A,2,false,"Arabidopsis translation initiation landscape - NTA",167a,35069635,,,,,,,,
ADQLTDEQISEFK,ph,T,6,false,"SIRK1 phosphorylation",86a,23820729,"MaxQuant Score",71.0290000,0.9980000,,,,0.87800002098083,2.7950000
ADQLTDEQISEFK,ph,T,6,false,"Lateral root-induction - NAA vs control",106,23328941,"MASCOT Score",23.0000000,,,,,,
ADQLTDEQISEFK,ph,T,6,false,"Tissue atlas Arabidopsis - ProteomicsDB",114,32188942,"MaxQuant score",155.2200000,1.0000000,,,,3.1565100533371E-10,
EAFSLFDKDGDGCITTK,ac,K,22,false,"Histone deacetylases - apicidin vs control",98a,29061669,"MaxQuant Score",93.4000000,1.0000000,0.0660000,0.8511380,NO,1.4000000192027E-5,
EAFSLFDKDGDGCITTK,ac,K,22,false,"Histone deacetylases substrates - hda14 vs WT",98e,29061669,"MaxQuant Score",96.2000000,1.0000000,0.1110000,0.9120108,NO,2.4000000934093E-15,
EAFSLFDKDGDGCITTKELGTVMR,ub,K,22,false,"upl3 mutant / wildtype",168,35926874,"MaxQuant score",138.9100000,1.0000000,-0.1031469,0.8349600,NO,4.940819888638E-12,0.4862500
EAFSLFDKDGDGCITTK,sno,C,27,false,"Site-specific nitrosomeproteomic id - gsnor1-3",90a,25699590,XCorr,3.9261184,,,,,0.083650000393391,-7.1481670
EAFSLFDKDGDGCITTK,sno,C,27,false,"Site-specific nitrosomeproteomic id - gsnor1-3",90b,25699590,XCorr,4.0100000,,,,,0.14180000126362,-6.4000000
DGDGCITTK,sno,C,27,false,"hot5-4 / wildtype, FAT-switch S-nitrosoproteome",169,37277371,,,,,,,,
ITTKELGTVMR,nt,I,28,false,"Arabidopsis translation initiation landscape - NT",167b,35069635,,,,,,,,
EAFSLFDKDGDGCITTKELGTVMR,ub,K,31,false,"upl3 mutant / wildtype",168,35926874,"MaxQuant score",138.9100000,1.0000000,-0.1031469,0.8349600,NO,4.940819888638E-12,0.4862500
KMKDTDSEEELKEAFR,ub,K,76,false,"Arabidopsis ubiquitination COFRADIC",40,26744219,"MaxQuant Score",183.3100000,1.0000000,,,,0,0.5190000
KMKDTDSEEELKEAFR,ub,K,78,false,"Arabidopsis ubiquitination COFRADIC",40,26744219,"MaxQuant Score",183.3100000,1.0000000,,,,0,0.5190000
MKDTDSEEELKEAFR,ub,K,78,false,"upl3 mutant / wildtype",168,35926874,"MaxQuant score",97.2350000,1.0000000,-0.0588937,0.9610800,NO,1.5980999705789E-6,-1.4101000
MKDTDSEEELKEAFR,ph,T,80,false,"SnRK2 protein kinase substrates",85,23776212,XCorr,2.7260747,0.9870000,,,,1.1789899723169E-8,
MKDTDSEEELKEAFR,ph,T,80,false,"atm and atr DNA damage response",88,25561503,"MASCOT Score",49.0000000,1.0000000,,,,,0.5700000
MKDTDSEEELKEAFR,ph,T,80,false,"Tissue atlas Arabidopsis - ProteomicsDB",114,32188942,"MaxQuant score",183.0700000,0.9979140,,,,2.7194500593297E-25,
MKDTDSEEELKEAFR,ph,T,80,false,"Touch-induced phosphorylation: 40s touch vs untouc",136,30291188,"MASCOT score",85.1600000,,0.2356702,0.5795652,NO,,9.4782396
DTDSEEELKEAFR,ph,T,80,false,"Arabidopsis root NAA phosphoproteome",18a,27643528,"MaxQuant Score",163.8000000,0.9980000,,,,2.0600000095902E-16,-0.5950000
DTDSEEELKEAFR,ph,T,80,false,"Large-scale phosphorylation discovery",44,23111157,XCorr,2.4880000,,,,,,
MKDTDSEEELK,ph,T,80,false,"Tyrosine phosphorylation in Arabidopsis",59,18463617,"MASCOT Score",59.0000000,,,,,,-0.5699825
MKDTDSEEELK,ph,T,80,false,"srk2dei ABA signaling phopshoproteomics",83,23572148,"MASCOT Score",21.0000000,,,,,,0.0041000
MKDTDSEEELK,ph,T,80,false,"atm and atr DNA damage response",88,25561503,"MASCOT Score",56.0000000,0.9990000,,,,,-1.5100000
MKDTDSEEELK,ph,T,80,false,"TOR Kinase and ABA Receptor",100,29290610,XCorr,3.6522198,0.9997000,,,,0.0011200000299141,
MKDTDSEEELKEAFR,ph,S,82,false,"atm and atr DNA damage response",88,25561503,"MASCOT Score",33.0000000,0.9950000,,,,,-0.0900000
MKDTDSEEELKEAFR,ph,S,82,false,"Phospho cell culture sucrose/TOR",109,30833711,,,1.0000000,,,,,
DTDSEEELKEAFR,ph,S,82,false,"atm and atr DNA damage response",88,25561503,"MASCOT Score",38.0000000,1.0000000,,,,,-0.5300000
DTDSEEELKEAFR,ph,S,82,false,"Tissue atlas Arabidopsis - ProteomicsDB",114,32188942,"MaxQuant score",178.2300000,0.9999970,,,,2.1265199981088E-21,
MKDTDSEEELK,ph,S,82,false,"Tyrosine phosphorylation in Arabidopsis",59,18463617,"MASCOT Score",59.0000000,,,,,,-0.1424956
MKDTDSEEELK,ph,S,82,false,"atm and atr DNA damage response",88,25561503,"MASCOT Score",31.0000000,1.0000000,,,,,-1.5600000
KMKDTDSEEELKEAFR,ub,K,87,false,"Arabidopsis ubiquitination COFRADIC",40,26744219,"MaxQuant Score",126.6300000,1.0000000,,,,2.1920000550992E-28,-0.6190000
DTDSEEELKEAFR,ub,K,87,false,"upl3 mutant / wildtype",168,35926874,"MaxQuant score",172.7600000,1.0000000,-0.7685676,0.4169400,NO,9.4032197969134E-17,0.3825600
VFDKDQNGFISAAELR,ub,K,95,false,"Arabidopsis ubiquitination COFRADIC",40,26744219,"MaxQuant Score",223.9700000,1.0000000,,,,0,-0.2180000
VFDKDQNGFISAAELR,ub,K,95,false,"upl3 mutant / wildtype",168,35926874,"MaxQuant score",146.3000000,1.0000000,0.0384362,0.9462600,NO,1.6738399674556E-13,-1.2016000
VFDKDQNGFISAAELR,ph,S,102,false,"Phospho cell culture sucrose/TOR",109,30833711,,,1.0000000,,,,,
VFDKDQNGFISAAELR,ph,S,102,false,"Tissue atlas Arabidopsis - ProteomicsDB",114,32188942,"MaxQuant score",53.0330000,1.0000000,,,,0.00090184900909662,
DQNGFISAAELR,ph,S,102,false,"Tyrosine phosphorylation in Arabidopsis",59,18463617,"MASCOT Score",54.0000000,,,,,,-0.5001385
DQNGFISAAELR,ph,S,102,false,"srk2dei ABA signaling phopshoproteomics",83,23572148,"MASCOT Score",75.0000000,,,,,,0.0007000
HVMTNLGEK,ph,T,111,false,"Phospho cell culture sucrose/TOR",109,30833711,,,1.0000000,,,,,
HVMTNLGEKLTDEEVEEMIR,me1,K,116,false,"Arabidopsis protein methylome",123,31809900,"MaxQuant Score",72.1630000,1.0000000,,,,3.0383000648726E-7,-0.3691900
HVMTNLGEKLTDEEVEEMIR,me3,K,116,false,"Arabidopsis protein methylome",123,31809900,"MaxQuant Score",226.7200000,1.0000000,,,,0,0.5503400
