Peptide,PTM,ModifiedAA,ModifiedPosition,PeptideUniqueToGene,ExperimentDesc,ExpID,PubmedID,ScoreType,IdentScore,LocProb,Log2FChange,PQ-val,QuantSig,PEP,MassErrorPPM
SGALNMTLDEIVKR,nt,S,2,true,"N-terminal ChaFRADIC",92,26010716,"MASCOT Score",51.8400000,,,,,0.00020510000467766,
SGALNMTLDEIVKR,nt,S,2,true,"Arg/N-end rule seed, prt6 vs. Wt",99,29168982,"MASCOT Score",67.2400000,,,,,0.003713000100106,-1.5570659
SGALNMTLDEIVKR,nta,S,2,true,"Arg/N-end rule pathway Roots",80,25728785,"MASCOT Score",60.4700000,,,,,0.00018350000027567,
SGALNMTLDEIVKR,nta,S,2,true,"N-terminal ChaFRADIC",92,26010716,"MASCOT Score",51.8400000,,,,,0.00020510000467766,
SGALNMTLDEIVKR,nta,S,2,true,"Arg/N-end rule seed, prt6 vs. Wt",99,29168982,"MASCOT Score",67.2400000,,0.0315359,0.7941422,NO,0.003713000100106,-1.5570659
SGALNMTLDEIVKR,nta,S,2,true,"HUNTER N-terminome: legumain, GluC and trypsin",119,31951383,"MaxQuant score",107.4000000,,,,,,
SGALNMTLDEIVKR,nta,S,2,true,"Arabidopsis translation initiation landscape - NTA",167a,35069635,,,,,,,,
SGALNMTLDEIVK,nta,S,2,true,"Characterization plant N-terminal acetylation",6,22223895,"MASCOT Score",59.7400000,,,,,,
MSGALNMTLDEIVK,ph,T,8,true,"BSK8 and BSL2 regulating sucrose-ph synthase",66,24924143,"MaxQuant Score",90.8610000,,,,,,-1.7433000
SGALNMTLDEIVKR,ub,K,14,true,"Arabidopsis ubiquitination COFRADIC",40,26744219,"MaxQuant Score",98.9420000,1.0000000,,,,4.0699998749005E-7,-0.0370000
PSSFTINKPVR,ph,S,57,true,"Tissue atlas Arabidopsis - ProteomicsDB",114,32188942,"MaxQuant score",78.2870000,0.9846480,,,,0.00039186701178551,
VRSLPWQSGLFEDGLR,ph,S,69,true,"TOR Kinase and ABA Receptor",100,29290610,XCorr,4.2641916,1.0000000,,,,2.753999979177E-7,
RSDAFQALKK,ph,S,144,true,"Tissue atlas Arabidopsis - ProteomicsDB",114,32188942,"MaxQuant score",61.1610000,1.0000000,,,,0.0046085398644209,
RSDAFQALK,ph,S,144,true,"atm and atr DNA damage response",88,25561503,"MASCOT Score",44.0000000,1.0000000,,,,,0.6700000
KYNNVLLDGR,ub,K,152,false,"Arabidopsis ubiquitination COFRADIC",40,26744219,"MaxQuant Score",104.8200000,1.0000000,,,,4.1110000893241E-5,-1.0770000
LEILGGNNSSEAPLSGR,ph,S,173,true,"atm and atr DNA damage response",88,25561503,"MASCOT Score",37.0000000,0.9480000,,,,,-0.2100000
LEILGGNNSSEAPLSGR,ph,S,173,true,"Tissue atlas Arabidopsis - ProteomicsDB",114,32188942,"MaxQuant score",156.0800000,0.8983760,,,,3.3202299221962E-16,
LEILGGNNSSEAPLSGR,ph,S,179,true,"Tissue atlas Arabidopsis - ProteomicsDB",114,32188942,"MaxQuant score",125.5100000,0.9998000,,,,1.4229799560894E-9,
SYHADAMNTS,nt,S,279,true,"N-terminal ChaFRADIC",92,26010716,"MASCOT Score",55.7800000,,,,,0.00063859997317195,
DLESYHADAMNTS,ph,S,279,true,"Tissue atlas Arabidopsis - ProteomicsDB",114,32188942,"MaxQuant score",135.9400000,1.0000000,,,,3.6791800084757E-5,
DLESYHADAMNTS,ph,T,287,true,"Tissue atlas Arabidopsis - ProteomicsDB",114,32188942,"MaxQuant score",120.2100000,0.9222030,,,,0.00017852199380286,
