Peptide,PTM,ModifiedAA,ModifiedPosition,PeptideUniqueToGene,ExperimentDesc,ExpID,PubmedID,ScoreType,IdentScore,LocProb,Log2FChange,PQ-val,QuantSig,PEP,MassErrorPPM
LLQSQTSNFFLR,ph,S,23,true,"Tissue atlas Arabidopsis - ProteomicsDB",114,32188942,"MaxQuant score",183.0600000,0.9381090,,,,8.0413296961834E-20,
IVSKPELQSPESAAVSEPEPPTQILPPR,nt,I,30,true,"Arabidopsis translation initiation landscape - NT",167b,35069635,,,,,,,,
SPESAAVSEPEPPTQILPPR,nt,S,38,true,"Mitochondrial intermediate peptidases - icp55 / WT",131a,25732537,,142.5000000,,6.2617964,,,,
PESAAVSEPEPPTQILPPRNPVGGARVHF,nt,P,39,true,"Arabidopsis translation initiation landscape - NT",167b,35069635,,,,,,,,
PESAAVSEPEPPTQILPPR,nt,P,39,true,"Arg/N-end rule seed, prt6 vs. Wt",99,29168982,"MASCOT Score",67.2200000,,-0.1173260,0.3951563,NO,0.0003296000068076,0.0808387
SNPEDAIEVF,nt,S,68,true,"N-terminal ChaFRADIC",92,26010716,"MASCOT Score",39.6600000,,,,,6.4949999796227E-5,
GFTVLQACEVAGVDIPR,ox,C,95,true,"Redox kickstart of mitochondria",112,31871212,,,,-0.6175385,0.0066413,YES,,
EVAGVDIPR,nt,E,96,true,"Arg/N-end rule seed, prt6 vs. Wt",99,29168982,"MASCOT Score",44.0700000,,-0.5482054,0.0047553,NO,0.038430001586676,-1.4002620
LSIAGNCR,ox,C,117,true,"Redox kickstart of mitochondria",112,31871212,,,,-0.2869589,0.0140380,YES,,
LSIAGNCR,sno,C,117,true,"hot5-4 / wildtype, FAT-switch S-nitrosoproteome",169,37277371,,,,,,,,
LSIAGNCR,so,C,117,true,"Arabidopsis S-sulfenylation chemoproteomics",108,31578252,"pFind PSM Score",0.1398240,,0.9345800,,,,-0.6232222
MCLVEVEKSPK,me2,K,126,true,"Arabidopsis protein methylome",123,31809900,"MaxQuant Score",108.5600000,1.0000000,,,,1.947230003907E-7,3.2788000
MCLVEVEKSPK,me3,K,126,true,"Arabidopsis protein methylome",123,31809900,"MaxQuant Score",142.1000000,0.9999930,,,,1.2571048523458E-41,-0.3569000
PVASCAMPALPGMK,ox,C,134,true,"Redox kickstart of mitochondria",112,31871212,,,,-0.6636490,0.0030454,YES,,
IKTDTPIAK,ac,K,145,true,"Quantitative Acetylproteomics",101,29440448,,,,,,,,
IKTDTPIAKK,ac,K,152,true,"Quantitative Acetylproteomics",101,29440448,,,,,,,,
CIQCTR,sno,C,221,true,"hot5-4 / wildtype, FAT-switch S-nitrosoproteome",169,37277371,,,,,,,,
GSGEEIGTYVEK,ph,S,244,true,"Tissue atlas Arabidopsis - ProteomicsDB",114,32188942,"MaxQuant score",100.0200000,1.0000000,,,,0.00013203600246925,
LMTSELSGNVIDICPVGALTSKPFAFK,ox,C,268,true,"Redox kickstart of mitochondria",112,31871212,,,,-0.5690536,0.0161369,YES,,
LMTSELSGNVIDICPVGALTSK,ox,C,268,true,"Redox kickstart of mitochondria",112,31871212,,,,-1.0932083,0.0029022,YES,,
FCYDGLK,ox,C,335,true,"Redox kickstart of mitochondria",112,31871212,,,,-1.0706514,0.0111295,YES,,
MGSDNVWCEGTAAGVDADLR,ox,C,410,true,"Redox kickstart of mitochondria",112,31871212,,,,-1.0027082,0.0036564,YES,,
EGTAAGVDADLR,nt,E,411,true,"Arg/N-end rule seed, prt6 vs. Wt",99,29168982,"MASCOT Score",69.3200000,,-0.5364568,0.0730443,NO,0.0018019999843091,-0.1596936
VGYVGPPAEFNYDCK,ox,C,482,true,"Redox kickstart of mitochondria",112,31871212,,,,-1.0369825,0.0010674,YES,,
VGYVGPPAEFNYDCK,sno,C,482,true,"hot5-4 / wildtype, FAT-switch S-nitrosoproteome",169,37277371,,,,1.2015708,0.0010868,YES,,
HPFCTALK,ox,C,503,true,"Redox kickstart of mitochondria",112,31871212,,,,-1.2009034,0.0041121,YES,,
SVAPNLVHTDEREPAAFGPSLKPECK,ox,C,706,true,"Redox kickstart of mitochondria",112,31871212,,,,-1.9921284,0.0044846,YES,,
EPAAFGPSLKPECK,ox,C,706,true,"Redox kickstart of mitochondria",112,31871212,,,,-1.0293524,0.0089680,YES,,
EPAAFGPSLKPECK,sno,C,706,true,"Site-specific nitrosomeproteomic id - gsnor1-3",90a,25699590,XCorr,2.1447809,,,,,0.014659999869764,-6.2728736
EPAAFGPSLKPECK,sno,C,706,true,"Site-specific nitrosomeproteomic id - gsnor1-3",90b,25699590,XCorr,2.7300000,,,,,0.25450000166893,-6.0800000
EPAAFGPSLKPECK,sno,C,706,true,"hot5-4 / wildtype, FAT-switch S-nitrosoproteome",169,37277371,,,,0.6436506,0.0312258,YES,,
EPAAFGPSLKPECK,so,C,706,true,"Arabidopsis S-sulfenylation chemoproteomics",108,31578252,"pFind PSM Score",0.1519670,,,,,,-0.3768756
IMAQCSAVLLK,ox,C,738,true,"Redox kickstart of mitochondria",112,31871212,,,,-1.5031378,0.0013744,YES,,
IMAQCSAVLLK,ox,C,738,true,"SPEAR - 10 mM H2O2 / mock",138a,34619326,,,,-0.7869234,0.0198538,YES,,
IMAQCSAVLLK,ox,C,738,true,"SPEAR - 50 mM H2O2 / mock",138b,34619326,,,,-0.5408534,0.0439207,YES,,
