Peptide,PTM,ModifiedAA,ModifiedPosition,PeptideUniqueToGene,ExperimentDesc,ExpID,PubmedID,ScoreType,IdentScore,LocProb,Log2FChange,PQ-val,QuantSig,PEP,MassErrorPPM
AEIQSNGR,nta,A,2,true,"Arabidopsis translation initiation landscape - NTA",167a,35069635,,,,,,,,
ASLSVSFGQR,ph,S,207,true,"Tissue atlas Arabidopsis - ProteomicsDB",114,32188942,"MaxQuant score",100.9300000,0.9983890,,,,0.00040702399564907,
GSSPVRRPPPTGYDR,ph,S,222,true,"srk2dei ABA signaling phopshoproteomics",83,23572148,"MASCOT Score",28.0000000,,,,,,-0.0017000
GSSPVRRPPPTGYDR,ph,S,222,true,"Tissue atlas Arabidopsis - ProteomicsDB",114,32188942,"MaxQuant score",63.5780000,0.8539990,,,,0.00038277899147943,
NGGDEVQQRSPR,ph,S,244,true,"atm and atr DNA damage response",88,25561503,"MASCOT Score",36.0000000,1.0000000,,,,,-0.3100000
NGGDEVQQRSPR,ph,S,244,true,"Tissue atlas Arabidopsis - ProteomicsDB",114,32188942,"MaxQuant score",80.7380000,1.0000000,,,,0.00032837598701008,
DYYSDRDSDR,ph,S,255,true,"atm and atr DNA damage response",88,25561503,"MASCOT Score",34.0000000,0.9960000,,,,,-0.2500000
DYYSDRDSDR,ph,S,255,true,"Tissue atlas Arabidopsis - ProteomicsDB",114,32188942,"MaxQuant score",125.8200000,0.9999870,,,,0.00015271200390998,
DYYSDRDSDRQR,ph,S,259,true,"Tissue atlas Arabidopsis - ProteomicsDB",114,32188942,"MaxQuant score",57.4990000,0.9788650,,,,0.0058461301960051,
SRSVQIEREPTPK,ph,S,325,true,"Tissue atlas Arabidopsis - ProteomicsDB",114,32188942,"MaxQuant score",101.7200000,1.0000000,,,,0.0037442098837346,
SVQIEREPTPK,ph,S,327,true,"Chloroplast kinase substrates",60,19376835,"MASCOT Score",33.9000000,,,,,,-0.7679320
SVQIEREPTPK,ph,S,327,true,"Tissue atlas Arabidopsis - ProteomicsDB",114,32188942,"MaxQuant score",108.2500000,1.0000000,,,,7.893919973867E-5,
SVQIER,ph,S,327,false,"STN8 phosphoproteome",38,21768351,"MASCOT Score",46.9400000,,,,,,-0.5457830
SVQIEREPTPK,ph,T,335,true,"Chloroplast kinase substrates",60,19376835,"MASCOT Score",39.6500000,,,,,,-0.2347690
SVQIEREPTPK,ph,T,335,true,"atm and atr DNA damage response",88,25561503,"MASCOT Score",25.0000000,1.0000000,,,,,0.8300000
SVQIEREPTPK,ph,T,335,true,"TOR Kinase and ABA Receptor",100,29290610,XCorr,3.0195785,1.0000000,,,,0.0033390000462532,
SVQIEREPTPK,ph,T,335,true,"Tissue atlas Arabidopsis - ProteomicsDB",114,32188942,"MaxQuant score",126.6300000,1.0000000,,,,5.8546800573822E-5,
KDSSSEEVIK,ph,S,380,true,"atm and atr DNA damage response",88,25561503,"MASCOT Score",50.0000000,0.9700000,,,,,-2.0900000
