Peptide,PTM,ModifiedAA,ModifiedPosition,PeptideUniqueToGene,ExperimentDesc,ExpID,PubmedID,ScoreType,IdentScore,LocProb,Log2FChange,PQ-val,QuantSig,PEP,MassErrorPPM
MDDIDSSDGAAAAR,nta,M,1,true,"FtsH12 N-terminome: WT / FtsH12 knockdown miRNA",118,33216923,"MaxQuant score",86.5570000,,,,,1.0699999775099E-9,
MDDIDSSDGAAAAR,nta,M,1,true,"Arabidopsis translation initiation landscape - NTA",167a,35069635,,,,,,,,
TVYSYIQSR,ph,S,283,true,"STN8 phosphoproteome",38,21768351,"MASCOT Score",48.5100000,,,,,,-0.1047000
TVYSYIQSR,ph,S,283,true,"Tyrosine phosphorylation - flg22 vs mock",105,22074104,"MASCOT Score",37.8200000,,,,,,-1.3241018
TVYSYIQSR,ph,Y,284,true,"Arabidopsis root NAA phosphoproteome",18a,27643528,"MaxQuant Score",78.9390000,0.9280000,,,,0.00070819997927174,-1.1160000
TVYSYIQSR,ph,Y,284,true,"Ph protein kinases and peptide chip analysis",27,18433157,,,,,,,,
TVYSYIQSR,ph,Y,284,true,"ABA-induced protein phosphorylation",35,20733066,,,,,,,,
TVYSYIQSR,ph,Y,284,true,"Tyrosine phosphorylation in Arabidopsis",59,18463617,"MASCOT Score",54.0000000,,,,,,-0.8364516
TVYSYIQSR,ph,Y,284,true,"Chloroplast kinase substrates",60,19376835,"MASCOT Score",32.6400000,,,,,,-3.2611700
TVYSYIQSR,ph,Y,284,true,"Conserved plant phosphoproteome - Arabidopsis",61a,20466843,"MASCOT Score",54.0000000,1.0000000,,,,,
TVYSYIQSR,ph,Y,284,true,"srk2dei ABA signaling phopshoproteomics",83,23572148,"MASCOT Score",65.0000000,,,,,,-0.0002000
TVYSYIQSR,ph,Y,284,true,"LAXIC - ABA stress",84a,23660473,XCorr,2.2500000,0.9690000,,,,0.059529200196266,
TVYSYIQSR,ph,Y,284,true,"SnRK2 protein kinase substrates",85,23776212,XCorr,2.2396736,0.9990000,,,,4.6810200160508E-7,
TVYSYIQSR,ph,Y,284,true,"atm and atr DNA damage response",88,25561503,"MASCOT Score",30.0000000,1.0000000,,,,,-0.1500000
TVYSYIQSR,ph,Y,284,true,"TOR Kinase and ABA Receptor",100,29290610,XCorr,3.0553346,0.9481000,,,,0.000161100004334,
TVYSYIQSR,ph,Y,284,true,"Lateral root-induction - NAA vs control",106,23328941,"MASCOT Score",24.0000000,,,,,,
TVYSYIQSR,ph,Y,284,true,"Phospho cell culture sucrose/TOR",109,30833711,,,0.8048870,,,,,
TVYSYIQSR,ph,Y,284,true,"Tissue atlas Arabidopsis - ProteomicsDB",114,32188942,"MaxQuant score",131.2200000,0.9992490,,,,3.4485398980877E-9,
TVYSYIQSR,ph,S,287,true,"Tissue atlas Arabidopsis - ProteomicsDB",114,32188942,"MaxQuant score",58.3660000,0.8377850,,,,0.00011057299707318,
HPFITGEPFTCPYNPPPETPR,ph,T,479,true,"Tissue atlas Arabidopsis - ProteomicsDB",114,32188942,"MaxQuant score",91.6430000,0.9999660,,,,1.2530300352864E-7,
VDHHPGEGHWFAAGLSPHVSGR,ph,S,505,true,"TOR Kinase and ABA Receptor",100,29290610,XCorr,4.2356048,0.9999000,,,,2.502999996068E-5,
VDHHPGEGHWFAAGLSPHVSGR,ph,S,505,true,"Phospho cell culture sucrose/TOR",109,30833711,,,0.9783480,,,,,
VDHHPGEGHWFAAGLSPHVSGR,ph,S,505,true,"Tissue atlas Arabidopsis - ProteomicsDB",114,32188942,"MaxQuant score",213.3700000,0.9999160,,,,0,
NSCHGSPLGK,ph,S,656,true,"atm and atr DNA damage response",88,25561503,"MASCOT Score",35.0000000,1.0000000,,,,,-0.4800000
NSCHGSPLGK,ph,S,656,true,"Tissue atlas Arabidopsis - ProteomicsDB",114,32188942,"MaxQuant score",146.8800000,1.0000000,,,,7.3315601412105E-7,
MAAFSQINRR,ph,S,665,true,"Tissue atlas Arabidopsis - ProteomicsDB",114,32188942,"MaxQuant score",55.2610000,1.0000000,,,,0.0045911502093077,
YAPNQAFSQVETGSPPSNDPHAR,ph,S,841,true,"TOR Kinase and ABA Receptor",100,29290610,XCorr,3.5587447,0.8348000,,,,5.9459998738021E-5,
RYAPNQAFSQVETGSPPSNDPHAR,ph,S,847,true,"TOR Kinase and ABA Receptor",100,29290610,XCorr,6.0182891,0.9788000,,,,4.9770000032368E-7,
YAPNQAFSQVETGSPPSNDPHAR,ph,S,847,true,"Phospho cell culture sucrose/TOR",109,30833711,,,0.9718010,,,,,
YAPNQAFSQVETGSPPSNDPHAR,ph,S,847,true,"Tissue atlas Arabidopsis - ProteomicsDB",114,32188942,"MaxQuant score",293.7500000,0.9998760,,,,0,
FGQHIPGSQYIPHVSQNSPSR,ph,S,871,true,"Tissue atlas Arabidopsis - ProteomicsDB",114,32188942,"MaxQuant score",145.3400000,0.8264200,,,,1.7196800420459E-25,
FGQHIPGSQYIPHVSQNSPSR,ph,S,874,true,"TOR Kinase and ABA Receptor",100,29290610,XCorr,3.6809971,0.8052000,,,,0.0022479998879135,
NHMNAQLPPSNTNSGGQQRSPR,ph,S,919,true,"TOR Kinase and ABA Receptor",100,29290610,XCorr,4.2414889,0.9774000,,,,0.003084999974817,
SSSYTNGVPWGR,ph,S,924,true,"atm and atr DNA damage response",88,25561503,"MASCOT Score",28.0000000,0.8310000,,,,,-0.3200000
SSSYTNGVPWGR,ph,S,924,true,"Tissue atlas Arabidopsis - ProteomicsDB",114,32188942,"MaxQuant score",108.6800000,0.9965750,,,,7.2116999945138E-5,
