Peptide,PTM,ModifiedAA,ModifiedPosition,PeptideUniqueToGene,ExperimentDesc,ExpID,PubmedID,ScoreType,IdentScore,LocProb,Log2FChange,PQ-val,QuantSig,PEP,MassErrorPPM
AQILAASPTCQMR,nt,A,2,true,"FtsH12 N-terminome: WT / FtsH12 knockdown miRNA",118,33216923,"MaxQuant score",54.2710000,,,,,0.0041446997784078,
FRVLALQSDNSTVNRVE,nt,F,47,true,"N-terminal ChaFRADIC",92,26010716,"MASCOT Score",29.9800000,,,,,2.7589999174182E-9,
ALQSDNSTVNRVETLLNLDTKPYSDR,nt,A,51,true,"Stromal N-terminome",96,26371235,"MASCOT Score",44.5500000,,,,,,
ALQSDNSTVNRVE,nt,A,51,true,"N-terminal ChaFRADIC",92,26010716,"MASCOT Score",57.5900000,,,,,2.7739999950427E-6,
ALQSDNSTVNR,nt,A,51,true,"Tic56 chloroplast import - wild-type",89a,25588737,XCorr,2.8916092,,,,,,
ALQSDNSTVNR,nt,A,51,true,"Tic56 chloroplast import - tic56-1",89c,25588737,XCorr,3.3070364,,,,,,
ALQSDNSTVNR,nt,A,51,true,"N-terminal ChaFRADIC",92,26010716,"MASCOT Score",32.8400000,,,,,0.00024229999689851,
LQSDNSTVNRVETLLNLDTKPYSDR,nt,L,52,true,"Stromal N-terminome",96,26371235,"MASCOT Score",64.5500000,,,,,,
LQSDNSTVNRVETLLNLDTKPYSDR,nt,L,52,true,"HUNTER N-terminome: legumain, GluC and trypsin",119,31951383,"MaxQuant score",58.2840000,,,,,,
LQSDNSTVNRVETLLNLDTKPYSDR,nt,L,52,true,"Arabidopsis translation initiation landscape - NT",167b,35069635,,,,,,,,
LQSDNSTVNRVETLLNL,nt,L,52,true,"N-terminal ChaFRADIC",92,26010716,"MASCOT Score",24.6500000,,,,,3.4070001220243E-7,
LQSDNSTVNRVETL,nt,L,52,true,"N-terminal ChaFRADIC",92,26010716,"MASCOT Score",48.1800000,,,,,1.6850000505997E-8,
LQSDNSTVNRVE,nt,L,52,true,"N-terminal ChaFRADIC",92,26010716,"MASCOT Score",72.5300000,,,,,0.00010029999975814,
LQSDNSTVNRVE,nt,L,52,true,"Arg/N-end rule seed, prt6 vs. Wt",99,29168982,"MASCOT Score",50.7500000,,-0.0624701,0.6830838,NO,3.0809998996517E-10,-1.7614170
LQSDNSTVNR,nt,L,52,true,"Arg/N-end rule pathway Roots",80,25728785,"MASCOT Score",53.2900000,,,,,6.90700035193E-5,
LQSDNSTVNR,nt,L,52,true,"N-terminal ChaFRADIC",92,26010716,"MASCOT Score",66.2300000,,,,,2.3000000510365E-5,
LQSDNSTVNR,nt,L,52,true,"Stromal N-terminome",96,26371235,"MASCOT Score",31.3600000,,,,,,
LQSDNSTVNR,nt,L,52,true,"Arg/N-end rule seed, prt6 vs. Wt",99,29168982,"MASCOT Score",55.0300000,,-0.0697815,0.5102097,NO,0.0073299999348819,-3.4469086
LQSDNSTVN,nt,L,52,true,"N-terminal ChaFRADIC",92,26010716,"MASCOT Score",37.3000000,,,,,3.8520001908182E-6,
LQSDNSTVNRVE,nta,L,52,true,"N-terminal ChaFRADIC",92,26010716,"MASCOT Score",72.5300000,,,,,0.00010029999975814,
LQSDNSTVNRVE,nta,L,52,true,"HUNTER N-terminome: legumain, GluC and trypsin",119,31951383,"MaxQuant score",140.3000000,,,,,,
LQSDNSTVNR,nta,L,52,true,"N-terminal ChaFRADIC",92,26010716,"MASCOT Score",55.1000000,,,,,0.0024949999060482,
LQSDNSTVNR,nta,L,52,true,"Arg/N-end rule seed, prt6 vs. Wt",99,29168982,"MASCOT Score",50.5400000,,,,,0.057050000876188,0.5930737
QSDNSTVNRVE,nt,Q,53,true,"N-terminal ChaFRADIC",92,26010716,"MASCOT Score",30.9500000,,,,,4.9169998419529E-6,
SDNSTVNRVE,nt,S,54,true,"N-terminal ChaFRADIC",92,26010716,"MASCOT Score",31.4800000,,,,,7.9840001490084E-6,
VETLLNLDTKPYSDR,ac,K,71,true,"Histone deacetylases - apicidin vs control",98a,29061669,"MaxQuant Score",115.1000000,1.0000000,0.1330000,0.4518559,NO,5.1000000667045E-8,
VETLLNLDTKPYSDR,ac,K,71,true,"Histone deacetylases substrates - hda14 vs WT",98e,29061669,"MaxQuant Score",68.5000000,1.0000000,0.0340000,0.9705100,NO,2.900000072259E-5,
VETLLNLDTKPYSDR,ph,S,74,true,"Tissue atlas Arabidopsis - ProteomicsDB",114,32188942,"MaxQuant score",114.4600000,0.9972270,,,,1.2044399682054E-6,
SRTIEKPVEDPSELPK,ph,S,95,true,"Tissue atlas Arabidopsis - ProteomicsDB",114,32188942,"MaxQuant score",153.8300000,0.7919980,,,,8.6780495983652E-12,
SRTIEKPVEDPSELPK,ph,T,97,true,"srk2dei ABA signaling phopshoproteomics",83,23572148,"MASCOT Score",23.0000000,,,,,,0.0001000
SRTIEKPVEDPSELPK,ph,T,97,true,"TOR Kinase and ABA Receptor",100,29290610,XCorr,2.8345721,0.9883000,,,,0.00046899999142624,
TIEKPVEDPSELPK,ac,K,100,true,"Histone deacetylases - apicidin vs control",98a,29061669,"MaxQuant Score",62.3000000,1.0000000,0.0400000,0.8109611,NO,3.4000000596279E-5,
TIEKPVEDPSELPK,ac,K,100,true,"Histone deacetylases substrates - hda14 vs WT",98e,29061669,"MaxQuant Score",47.0000000,1.0000000,0.0770000,0.9397233,NO,0.0020000000949949,
TIEKPVEDPSELPK,ph,S,106,true,"STN8 phosphoproteome",38,21768351,"MASCOT Score",66.9700000,,,,,,-1.0238000
TIEKPVEDPSELPK,ph,S,106,true,"Chloroplast kinase substrates",60,19376835,"MASCOT Score",67.4600000,,,,,,-1.0238000
TIEKPVEDPSELPK,ph,S,106,true,"srk2dei ABA signaling phopshoproteomics",83,23572148,"MASCOT Score",68.0000000,,,,,,-0.0011000
TIEKPVEDPSELPK,ph,S,106,true,"LAXIC - ABA stress",84a,23660473,XCorr,2.9700000,1.0000000,,,,0.06949920207262,
TIEKPVEDPSELPK,ph,S,106,true,"SnRK2 protein kinase substrates",85,23776212,XCorr,2.4723680,1.0000000,,,,0.00039578799623996,
TIEKPVEDPSELPK,ph,S,106,true,"atm and atr DNA damage response",88,25561503,"MASCOT Score",39.0000000,1.0000000,,,,,-1.4800000
TIEKPVEDPSELPK,ph,S,106,true,"Protein sumoylation and phosphorylation cross-talk",97,28419593,,,,,,,,
TIEKPVEDPSELPK,ph,S,106,true,"Phospho cell culture sucrose/TOR",109,30833711,,,1.0000000,,,,,
TIEKPVEDPSELPK,ph,S,106,true,"Tissue atlas Arabidopsis - ProteomicsDB",114,32188942,"MaxQuant score",174.5900000,1.0000000,,,,1.7503099409975E-16,
TIEKPVEDPSELPK,ph,S,106,true,"Touch-induced phosphorylation: 40s touch vs untouc",136,30291188,"MASCOT score",66.3500000,,0.2605091,0.6253549,NO,,1.7559244
GGNNILVICDTWTPAGEPIPTNK,sno,C,150,true,"Site-specific nitrosomeproteomic id - gsnor1-3",90a,25699590,XCorr,3.8800000,,,,,4.3380000533944E-6,-2.6200000
GGNNILVICDTWTPAGEPIPTNK,sno,C,150,true,"Site-specific nitrosomeproteomic id - gsnor1-3",90b,25699590,XCorr,3.0700000,,,,,0.00087340001482517,-6.5800000
DTWTPAGEPIPTNKR,nt,D,151,true,"FtsH12 N-terminome: WT / FtsH12 knockdown miRNA",118,33216923,"MaxQuant score",71.5480000,,,,,0.00072117999661714,
TWTPAGEPIPTNKR,nt,T,152,true,"HUNTER N-terminome: legumain, GluC and trypsin",119,31951383,"MaxQuant score",58.7520000,,,,,,
AAEIFSNKK,ph,S,173,true,"atm and atr DNA damage response",88,25561503,"MASCOT Score",32.0000000,1.0000000,,,,,-3.0500000
AAEIFSNKK,ph,S,173,true,"Tissue atlas Arabidopsis - ProteomicsDB",114,32188942,"MaxQuant score",61.5770000,1.0000000,,,,0.015820600092411,
AAEIFSNKK,ac,K,175,true,"Histone deacetylases substrates - TSA vs control",98b,29061669,"MaxQuant Score",119.7000000,1.0000000,0.1390000,0.9977001,NO,0.00063000002410263,
AAEIFSNKK,ac,K,175,true,"Quantitative Acetylproteomics",101,29440448,,,,,,,,
KVSGEVPWFGIEQEYTLLQQNVK,ph,S,178,true,"TOR Kinase and ABA Receptor",100,29290610,XCorr,4.6534648,1.0000000,,,,2.3770000552759E-5,
WPLGWPVGAFPGPQGPYYCGVGADKIWGR,ac,K,223,true,"Lysine acetylation gel-based Finkemeier et al",37,21311031,i-probability,1.0000000,,,,,,
QVGPSVGIDAGDHVWCAR,nt,Q,259,true,"HUNTER N-terminome: legumain, GluC and trypsin",119,31951383,"MaxQuant score",57.2670000,,,,,,
QAGVVLTLDPKPIEGDWNGAGCHTNYSTKSMREE,nt,Q,285,true,"HUNTER N-terminome: legumain, GluC and trypsin",119,31951383,"MaxQuant score",41.2090000,,,,,,
PIEGDWNGAGCHTNYSTK,so,C,306,true,"Arabidopsis S-sulfenylation chemoproteomics",108,31578252,"pFind PSM Score",0.3479540,,,,,,0.4788898
SMREEGGFEVIKK,ph,S,314,true,"Tissue atlas Arabidopsis - ProteomicsDB",114,32188942,"MaxQuant score",92.3900000,1.0000000,,,,0.00017366399697494,
SMREEGGFEVIK,ph,S,314,true,"atm and atr DNA damage response",88,25561503,"MASCOT Score",57.0000000,1.0000000,,,,,-0.4200000
SMREEGGFEVIKK,mox,M,315,true,"cat2 Methionine oxidation - 1h stress",62a,25693801,"MASCOT Score",62.0000000,,-0.0802043,,NO,,
SMREEGGFEVIKK,mox,M,315,true,"cat2 Methionine oxidation - 3h stress",62b,25693801,"MASCOT Score",53.0000000,,-0.1223244,,NO,,
SMREEGGFEVIK,mox,M,315,true,"cat2 Methionine oxidation - 1h stress",62a,25693801,"MASCOT Score",45.0000000,,0.5602013,,NO,,
SMREEGGFEVIKK,ac,K,325,true,"Quantitative Acetylproteomics",101,29440448,,,,,,,,
EEGGFEVIKK,ac,K,325,true,"Histone deacetylases - apicidin vs control",98a,29061669,"MaxQuant Score",152.6000000,1.0000000,0.2940000,0.2506109,NO,1.3999999944059E-11,
EEGGFEVIKK,ac,K,325,true,"Quantitative Acetylproteomics",101,29440448,,,,,,,,
EEGGFEVIKKAILNLSLR,hib,K,326,true,"Open search Plant PTM Viewer 2.0 - hib",164e,TBA,,,,,,,,
AILNLSLR,ph,S,332,true,"Tissue atlas Arabidopsis - ProteomicsDB",114,32188942,"MaxQuant score",121.5000000,1.0000000,,,,0.0029700000304729,
LTGKHETASIDQFSWGVANR,ac,K,353,true,"Histone deacetylases- hda14 vs WT (low light)",98c,29061669,"MaxQuant Score",222.0600000,1.0000000,1.2550000,0.7294575,NO,2.0999999917333E-25,
LTGKHETASIDQFSWGVANR,ac,K,353,true,"Quantitative Acetylproteomics",101,29440448,,,,,,,,
TASIDQFSWGVANRG,nt,T,356,true,"N-terminal ChaFRADIC",92,26010716,"MASCOT Score",38.2100000,,,,,1.4469999769062E-5,
TASIDQFSWGVA,nt,T,356,true,"N-terminal ChaFRADIC",92,26010716,"MASCOT Score",48.3200000,,,,,0.001077999942936,
TASIDQFSWG,nt,T,356,true,"N-terminal ChaFRADIC",92,26010716,"MASCOT Score",43.4900000,,,,,0.0091979997232556,
HETASIDQFSWGVANR,ph,S,358,true,"Tissue atlas Arabidopsis - ProteomicsDB",114,32188942,"MaxQuant score",92.4740000,0.8183440,,,,1.7899099475471E-5,
QFSWGVAN,nt,Q,361,true,"HUNTER N-terminome: legumain, GluC and trypsin",119,31951383,"MaxQuant score",101.5400000,,,,,,
DTEAKGK,ac,K,382,true,"Quantitative Acetylproteomics",101,29440448,,,,,,,,
GKGYLEDR,ac,K,384,true,"Histone deacetylases substrates - TSA vs control",98b,29061669,"MaxQuant Score",83.9000000,1.0000000,-0.0100000,0.9977001,NO,0.010999999940395,
GKGYLEDR,ac,K,384,true,"Quantitative Acetylproteomics",101,29440448,,,,,,,,
TTLLWEPTLE,nt,T,408,true,"N-terminal ChaFRADIC",92,26010716,"MASCOT Score",25.6500000,,,,,0.0090129999443889,
